{"text_format":"3","workbook":"xlsx","n_sheets":5,"sheets":["Instructions","Data","Calculator","Summary","Sheet1"],"not_rendered":{"images":1,"macros":1,"defined_names":4,"comments":2},"read":"whole","date_system":"1900"}

{"sheet":"Instructions","index":0,"n_rows":60,"n_cols":3,"rows_kept":60,"merged":[[3,0,3,7],[4,1,4,7],[5,1,5,7],[7,1,7,7],[10,1,10,7],[11,1,11,7],[12,1,12,7],[13,1,13,7],[14,1,14,7],[15,1,15,7],[16,1,16,7],[18,1,18,7],[19,1,19,7],[20,1,20,7],[21,1,21,7],[22,1,22,7],[23,1,23,7],[24,1,24,7],[25,1,25,7],[26,1,26,7],[27,1,27,7],[28,1,28,7],[29,1,29,7],[30,1,30,7],[31,1,31,7],[32,1,32,7],[33,1,33,7],[34,1,34,7],[35,1,35,7],[37,1,37,7],[38,1,38,7],[39,1,39,7],[39,8,39,14],[41,2,41,7],[42,2,42,7],[43,2,43,7],[44,2,44,7],[45,2,45,7],[46,2,46,7],[47,2,47,7],[49,1,49,7],[50,1,50,7],[51,1,51,7],[52,1,52,7],[54,1,54,7],[55,1,55,7],[56,1,56,7],[57,1,57,7],[58,1,58,7],[59,1,59,7]]}
[null,"Instructions"]
[]
[]
["This spreadsheet tool is supplied by Education Finance Support, EES for Schools. The spreadsheet may be used to assist with estimating the year end carry forward. An academy using this spreadsheet does so at their own risk whether used by an academy employee, Education Finance Support staff or anyone on the academy's behalf. Essex County Council, EES for Schools and the Education Finance Support team accept no liability for its use, the data input and any subsequent decision making or reports produced.  It remains the academy's responsibility to check the source data used and the output results."]
[null,"A Note on Macros\nThis spreadsheet makes use of macros to provide buttons on the screen for navigating around the spreadsheet and printing.  When you open this spreadsheet you may get a warning message on the screen stating that the macros have been disabled.  If this happens you will need to change the security settings in Excel.\nUsing Macros with Office 2007\nClick the Microsoft Office Button         , and then click Excel Options.\nClick Trust Center, click Trust Center Settings, and then click Macro Settings.\nSelect the  Disable all macros with notification option. This is the default setting. Clicking this option disables macros, but notifies you upon opening a spreadsheet with macros present, and asks you if you want to enable them. This way, you can choose when to enable those macros on a case by case basis."]
[null,"Introduction\nThis spreadsheet contains several pages (worksheets) that can be accessed by clicking on the grey navigation buttons (e.g. 'Summary Page'). This worksheet contains step by step instructions on using the spreadsheet.  There is a Data worksheet where the data can be imported from your financial accounting system (see below).  The Calculator worksheet is the main working area of the spreadsheet where you will produce your estimated cost centre balances.  The Summary worksheet converts the information on the Calculator worksheet into specific balance headings.  For this reason the Calculator worksheet must have been completed fully if the correct figures are to be produced on the Summary worksheet.  "]
[]
[null,"NB: When this spreadsheet has been completed, you will have produced estimate year end balances for every cost centre on FMS6. As a result of this you may decide to complete some virements and journals to amend individual cost centre balances.  Please do not enter these intended amendments on this spreadsheet as it will not accurately reflect the information on FMS6 at the point in time when the data was exported.  The effect of any virements and journals made on FMS6 after completing the spreadsheet will be reflected the next time you complete the estimated year end balance spreadsheet using the updated FMS6 data.  "]
[]
["A)","Exporting the Cost Centre Summary Report"]
["1)","Open FMS6 in the current financial year"]
["2)","Bring up the Cost Centre Summary by Cost Centre report on the screen by clicking on 'Reports', and selecting 'General Ledger', 'Transactions', 'Cost Centre Summary Transactions', 'Cost Centre Summary By Cost Centre' and then clicking on 'OK' on the screen that appears. The system will automatically default to select all cost centres.  Print a hard copy for future reference."]
["3)","Immediately after printing the report, click on the 'Export to Disk' icon, which can be found to the left of the 'Print' icon near the top right hand corner of the screen.\nNB: You may find it useful to print and export this report on a regular basis such as immediately after processing the monthly reconciliation data, even if the Estimated Year-End Balance Calculator is completed later. "]
["4)","In the window that appears, click on the diamond shaped radio button next to 'Full Report'."]
["5)","From the drop down menu select 'Tab Separated Values Format' and then click on 'OK'."]
["6)","Select the folder in to which you wish to export the file and give the file an appropriate name."]
["7)","Select 'OK' to save"]
[]
["B)","Loading the Exported File on to the Estimated Year-End Balance Calculator"]
["1)","Open the Estimated Year-End Balance Calculator in Excel"]
["2)","Select 'File'"]
["3)","Select 'Open'"]
["4)","In the window that appears, select the folder in which you have saved the exported file."]
["5)","Select 'All Files' from the drop down list that appears next to 'Files of Type:'"]
["6)","Select the exported file from the list of files in the chosen folder"]
["7)","Select 'Open'"]
["8)","In the window that appears, select 'Finish'."]
["9)","The file will now open in excel format. Some of the columns will not be wide enough for all the text to appear, but do not worry about this.  "]
["10)","Select the whole worksheet by clicking on the grey box to the left of the column header 'A' and above row header '1'.  The whole worksheet will now be highlighted."]
["11)","Select 'Edit'"]
{"$rows_left_out":31}
{"sheet":"Data","index":1,"n_rows":246,"n_cols":23,"rows_kept":246}
["Financial Year","2019/20","Fund","All","From Date:","N/A","To Date:","N/A","Show movement up to given period","13 Y/E","Cost Centre","All",1,1,1,1,1,1,1,1,"SJR","Shenfield High School",5467]
[5623,101,"Admin/Clerical Staff Costs",582920,0,0,611025.23,-28105.23,104.82]
[5631,102,"Catering Staff",0,0,0,0,0,0]
[5632,103,"Foreign Assistant",0,0,0,0,0,0]
[5629,104,"Vending Staff",0,0,0,0,0,0]
[5630,105,"Premises Staff",169494,0,0,169206.92,287.08,99.83]
[5575,106,"Midday Supervisors",4100,0,0,3779.72,320.28,92.19]
[5624,107,"Music Peri Teachers",0,0,0,0,0,0]
[5625,108,"Teachers-Main Scale",3260397,0,0,3301303.05,-40906.05,101.25]
[5577,112,"Leadership",903542,0,0,902116.02,1425.98,99.84]
[5578,113,"Unqual Teachers",45162,0,0,45492.7,-330.7,100.73]
[5579,114,"Cover Supervisors",21624,0,0,21589.31,34.69,99.84]
[5580,115,"Pastoral Staff",382270,0,0,380741.59,1528.41,99.6]
[5581,116,"Dept Technicians",108466,0,0,108294.36,171.64,99.84]
[5601,117,"LSA",176943,0,0,151955.46,24987.54,85.88]
[5603,118,"IT Technicians",75954,0,0,76007.69,-53.69,100.07]
[5658,120,"Science Technicians",83803,0,0,73613.7,10189.3,87.84]
[5659,121,"Library Staff",33974,0,0,32926.66,1047.34,96.92]
[5660,122,"Student Services",42956,0,0,42659.02,296.98,99.31]
[5661,150,"Supply Cost",20000,0,0,32187,-12187,160.94]
[5662,151,"Other Staff Cost",5000,0,0,3828.6,1171.4,76.57]
[5685,158,"Pension Deficiency",0,0,0,0,0,0]
[5769,199,"Other LA Income",-30100,0,0,-15875,-14225,52.74]
[5582,200,"ESFA Income",-6703119,0,0,-6715641.89,12522.89,100.19]
[5702,201,"LEA Income",-162307,0,0,-202656,40349,124.86]
[5591,202,"Bwt Fwd - Restricted Fund",0,0,0,0,0,0]
[5724,203,"Bwt Fwd - Unrestricted",-440270,0,0,0,-440270,0]
[5657,217,"Donations Income",0,0,0,0,0,0]
[5719,251,"EFA Capital Maint-Roofing-Inc",0,0,0,0,0,0]
[5767,252,"EFA Capital Cladding 17 Income",0,0,0,0,0,0]
{"$rows_left_out":217}
{"sheet":"Calculator","index":2,"n_rows":258,"n_cols":13,"rows_kept":258,"merged":[[7,5,7,7],[8,1,9,1],[8,2,9,3],[8,6,8,7],[9,6,9,7],[10,6,10,7],[11,1,12,1],[11,2,12,3],[11,6,11,7],[12,6,12,7]]}
[]
[null,"  Estimated Carry Forward Balance Calculator",{"$nulls":3},"Date:","2020-09-24"]
[{"$nulls":4},"Information as shown on cost centre report printed:   ","Time:","09:24:00"]
[{"$nulls":5},"Month",13]
[]
[]
[]
[{"$nulls":5},"Key to 'Cost Centre Type' Column Entries"]
[null,"Est. Year-End Revenue Balance",{"$f":"Summary!J21","v":{"v":103037.47999999998,"d":"£103,037.48"}},null,null,"L","Budget Share Funding, EFA, LA, B/fwd balances"]
[{"$nulls":5},"E","Contingencies earmarked for use after current year"]
[{"$nulls":5},"G","General Contingency"]
[null,"Est. Year-End Capital Balance",{"$f":"Summary!J25","v":{"v":0,"d":"£0.00"}},null,null,"C","Capital Income & Expenditure"]
[{"$nulls":5},"T","Cluster/Consortium/MAT Income & Expenditure"]
[]
["CC\nNo.","Cost Centre","Current\nAllocation","Current\nBalance"," Cost Centre Type:\n","Income due (not on report)\n","Additional Income:\nNotes","Expenditure due (not on report)","Additional Expenditure:\nNotes",null,null,"Est Yr-end\nActual\nInc/Exp","Est Yr-end\nBalance"]
[99,"TOTAL:",{"$f":"SUM(C17:C258)","v":{"v":0,"d":"0.00"}},{"$f":"SUM(D17:D258)","v":{"v":-248337.60999999978,"d":"-248,337.61"}},null,{"$f":"SUM(F17:F258)","v":{"v":545259.06,"d":"545,259.06"}},null,{"$f":"SUM(H17:H258)","v":{"v":193883.97,"d":"193,883.97"}},{"$nulls":3},{"$f":"SUM(L17:L258)","v":{"v":-103037.48000000019,"d":"-103,037.48"}},{"$f":"SUM(M17:M258)","v":{"v":103037.48000000001,"d":"103,037.48"}}]
[{"$f":"Sheet1!F11","v":101},{"$f":"Sheet1!G11","v":"Admin/Clerical Staff Costs"},{"$f":"Sheet1!H11","v":{"v":582920,"d":"582,920.00"}},{"$f":"Sheet1!I11","v":{"v":-28105.23,"d":"-28,105.23"}},"",{"v":0,"d":"0.00"},"",null,null,{"$f":"IF($D17+$F17-$H17>0,SUM($D17+$F17-$H17),0)","v":{"v":0,"d":"0.00"}},{"$f":"(IF($D17+$F17-$H17<=0,(SUM($D17+$F17-$H17)*-1),0))","v":{"v":28105.23,"d":"28,105.23"}},{"$f":"IF($E17=\"L\",C17,C17-J17+K17)","v":{"v":611025.23,"d":"611,025.23"}},{"$f":"IF($E17=\"L\",0,J17-K17)","v":{"v":-28105.23,"d":"-28,105.23"}}]
[{"$f":"Sheet1!F12","v":102},{"$f":"Sheet1!G12","v":"Catering Staff"},{"$f":"Sheet1!H12","v":{"v":0,"d":"0.00"}},{"$f":"Sheet1!I12","v":{"v":0,"d":"0.00"}},"",{"v":0,"d":"0.00"},"",{"v":0,"d":"0.00"},"",{"$f":"IF($D18+$F18-$H18>0,SUM($D18+$F18-$H18),0)","v":{"v":0,"d":"0.00"}},{"$f":"(IF($D18+$F18-$H18<=0,(SUM($D18+$F18-$H18)*-1),0))","v":{"v":0,"d":"0.00"}},{"$f":"IF($E18=\"L\",C18,C18-J18+K18)","v":{"v":0,"d":"0.00"}},{"$f":"IF($E18=\"L\",0,J18-K18)","v":{"v":0,"d":"0.00"}}]
[{"$f":"Sheet1!F13","v":103},{"$f":"Sheet1!G13","v":"Foreign Assistant"},{"$f":"Sheet1!H13","v":{"v":0,"d":"0.00"}},{"$f":"Sheet1!I13","v":{"v":0,"d":"0.00"}},"",{"v":0,"d":"0.00"},"",{"v":0,"d":"0.00"},"",{"$f":"IF($D19+$F19-$H19>0,SUM($D19+$F19-$H19),0)","v":{"v":0,"d":"0.00"}},{"$f":"(IF($D19+$F19-$H19<=0,(SUM($D19+$F19-$H19)*-1),0))","v":{"v":0,"d":"0.00"}},{"$f":"IF($E19=\"L\",C19,C19-J19+K19)","v":{"v":0,"d":"0.00"}},{"$f":"IF($E19=\"L\",0,J19-K19)","v":{"v":0,"d":"0.00"}}]
[{"$f":"Sheet1!F14","v":104},{"$f":"Sheet1!G14","v":"Vending Staff"},{"$f":"Sheet1!H14","v":{"v":0,"d":"0.00"}},{"$f":"Sheet1!I14","v":{"v":0,"d":"0.00"}},"",{"v":0,"d":"0.00"},"",{"v":0,"d":"0.00"},"",{"v":0,"d":"0.00"},{"v":0,"d":"0.00"},{"v":0,"d":"0.00"},{"v":0,"d":"0.00"}]
[{"$f":"Sheet1!F15","v":105},{"$f":"Sheet1!G15","v":"Premises Staff"},{"$f":"Sheet1!H15","v":{"v":169494,"d":"169,494.00"}},{"$f":"Sheet1!I15","v":287.08},"",{"v":0,"d":"0.00"},"",{"v":0,"d":"0.00"},"",287.08,{"v":0,"d":"0.00"},{"v":169206.92,"d":"169,206.92"},287.08]
[{"$f":"Sheet1!F16","v":106},{"$f":"Sheet1!G16","v":"Midday Supervisors"},{"$f":"Sheet1!H16","v":{"v":4100,"d":"4,100.00"}},{"$f":"Sheet1!I16","v":320.28},"",{"v":0,"d":"0.00"},"",{"v":0,"d":"0.00"},"",320.28,{"v":0,"d":"0.00"},{"v":3779.7200000000003,"d":"3,779.72"},320.28]
[{"$f":"Sheet1!F17","v":107},{"$f":"Sheet1!G17","v":"Music Peri Teachers"},{"$f":"Sheet1!H17","v":{"v":0,"d":"0.00"}},{"$f":"Sheet1!I17","v":{"v":0,"d":"0.00"}},null,{"v":0,"d":"0.00"},"",{"v":0,"d":"0.00"},"",{"v":0,"d":"0.00"},{"v":0,"d":"0.00"},{"v":0,"d":"0.00"},{"v":0,"d":"0.00"}]
[{"$f":"Sheet1!F18","v":108},{"$f":"Sheet1!G18","v":"Teachers-Main Scale"},{"$f":"Sheet1!H18","v":{"v":3260397,"d":"3,260,397.00"}},{"$f":"Sheet1!I18","v":{"v":-40906.05,"d":"-40,906.05"}},"",{"v":0,"d":"0.00"},"",{"v":0,"d":"0.00"},"",{"v":0,"d":"0.00"},{"v":40906.05,"d":"40,906.05"},{"v":3301303.05,"d":"3,301,303.05"},{"v":-40906.05,"d":"-40,906.05"}]
[{"$f":"Sheet1!F19","v":112},{"$f":"Sheet1!G19","v":"Leadership"},{"$f":"Sheet1!H19","v":{"v":903542,"d":"903,542.00"}},{"$f":"Sheet1!I19","v":{"v":1425.98,"d":"1,425.98"}},"",{"v":0,"d":"0.00"},"",{"v":0,"d":"0.00"},"",{"v":1425.98,"d":"1,425.98"},{"v":0,"d":"0.00"},{"v":902116.02,"d":"902,116.02"},{"v":1425.98,"d":"1,425.98"}]
[{"$f":"Sheet1!F20","v":113},{"$f":"Sheet1!G20","v":"Unqual Teachers"},{"$f":"Sheet1!H20","v":{"v":45162,"d":"45,162.00"}},{"$f":"Sheet1!I20","v":{"v":-330.7,"d":"-330.70"}},"",{"v":0,"d":"0.00"},"",{"v":0,"d":"0.00"},"",{"v":0,"d":"0.00"},{"v":330.7,"d":"330.70"},{"v":45492.7,"d":"45,492.70"},{"v":-330.7,"d":"-330.70"}]
[{"$f":"Sheet1!F21","v":114},{"$f":"Sheet1!G21","v":"Cover Supervisors"},{"$f":"Sheet1!H21","v":{"v":21624,"d":"21,624.00"}},{"$f":"Sheet1!I21","v":34.69},"",{"v":0,"d":"0.00"},"",{"v":0,"d":"0.00"},"",34.69,{"v":0,"d":"0.00"},{"v":21589.31,"d":"21,589.31"},34.69]
[{"$f":"Sheet1!F22","v":115},{"$f":"Sheet1!G22","v":"Pastoral Staff"},{"$f":"Sheet1!H22","v":{"v":382270,"d":"382,270.00"}},{"$f":"Sheet1!I22","v":{"v":1528.41,"d":"1,528.41"}},"",{"v":0,"d":"0.00"},"",{"v":0,"d":"0.00"},"",{"v":1528.41,"d":"1,528.41"},{"v":0,"d":"0.00"},{"v":380741.59,"d":"380,741.59"},{"v":1528.41,"d":"1,528.41"}]
[{"$f":"Sheet1!F23","v":116},{"$f":"Sheet1!G23","v":"Dept Technicians"},{"$f":"Sheet1!H23","v":{"v":108466,"d":"108,466.00"}},{"$f":"Sheet1!I23","v":171.64},"",{"v":0,"d":"0.00"},"",{"v":0,"d":"0.00"},"",171.64,{"v":0,"d":"0.00"},{"v":108294.36,"d":"108,294.36"},171.64]
[{"$f":"Sheet1!F24","v":117},{"$f":"Sheet1!G24","v":"LSA"},{"$f":"Sheet1!H24","v":{"v":176943,"d":"176,943.00"}},{"$f":"Sheet1!I24","v":{"v":24987.54,"d":"24,987.54"}},null,{"v":0,"d":"0.00"},"",{"v":0,"d":"0.00"},"",{"v":24987.54,"d":"24,987.54"},{"v":0,"d":"0.00"},{"v":151955.46,"d":"151,955.46"},{"v":24987.54,"d":"24,987.54"}]
{"$rows_left_out":229}
{"sheet":"Summary","index":3,"n_rows":25,"n_cols":10,"rows_kept":25,"merged":[[1,1,1,11],[2,2,2,10],[8,2,8,7],[8,9,8,10],[10,9,10,10],[12,2,12,7],[12,9,12,10],[14,9,14,10],[16,2,16,7],[16,9,16,10],[18,9,18,10],[20,9,20,10],[24,9,24,10],[28,9,28,10]]}
[]
[null,"Estimated Year End Balance Summary"]
[null,null,"This summary can be used to assist academies in reporting the Estimated Year End Revenue and Capital Balances to the Governors. It can also be used to estimate the total income and expenditure for completing the Budget Forecast Return ."]
[]
[]
[]
[null,null,"Estimated Revenue Balances as at 31/08/17"]
[]
[null,null,"Anticipated Cost Centre Underspends\n(excluding Contingency cost centres)",{"$nulls":6},{"$f":"SUMIF(Calculator!$E$17:$E$258,\"\",Calculator!$J$17:$J$258)","v":{"v":335627.8,"d":"335627.80"}}]
[]
[null,null,"Anticipated Cost Centre Overspends",{"$nulls":6},{"$f":"SUMIF(Calculator!$E$17:$E$258,\"\",Calculator!$K$17:$K$258)","v":232590.32}]
[]
[null,null,"Anticipated Unspent Standards Fund Grants"]
[]
[null,null,"Anticipated General (un-earmarked) contingency balance ",{"$nulls":6},{"$f":"SUMIF(Calculator!$E$17:$E$258,\"G\",Calculator!$J$17:$J$258)","v":{"v":0,"d":"0.00"}}]
[]
[null,null,"Balances on Contingency cost centres earmarked for expenditure\nafter 31/03/13",{"$nulls":6},{"$f":"SUMIF(Calculator!$E$17:$E$258,\"E\",Calculator!$J$17:$J$258)","v":{"v":0,"d":"0.00"}}]
[]
[null,null,"Anticipated Cluster/Consortium Balance ",{"$nulls":6},{"$f":"SUMIF(Calculator!$E$17:$E$258,\"T\",Calculator!$J$17:$J$258)-SUMIF(Calculator!$E$17:$E$258,\"T\",Calculator!$K$17:$K$258)","v":{"v":0,"d":"0.00"}}]
[]
[null,null,"Estimated 2016-17 Year End Revenue Balance",{"$nulls":6},{"$f":"J9-J11+J13+J15+J17+J19","v":{"v":103037.47999999998,"d":"103037.48"}}]
[]
[]
[]
[null,null,"Estimated 2016-17 Year End Capital Balance",{"$nulls":6},{"$f":"SUMIF(Calculator!$E$17:$E$258,\"C\",Calculator!$J$17:$J$258)-SUMIF(Calculator!$E$17:$E$258,\"C\",Calculator!$K$17:$K$258)","v":{"v":0,"d":"0.00"}}]

{"sheet":"Sheet1","index":4,"n_rows":252,"n_cols":14,"rows_kept":252,"merged":[[2,0,7,9]]}
[]
[]
["Please do not enter any data into this page or it is very likely that the macros will fail to run correctly and it will be necessary to download a fresh copy of this spreadsheet!"]
[]
[]
[]
[]
[]
[]
["Cost\nCentre \nNumber","Cost Centre Name","Allocation","Balance\nRemaining",null,"Cost\nCentre \nNumber","Cost Centre Name","Allocation","Balance\nRemaining","Cost CentreType:\n","Additional Income \ndue (not on report)\n","Additional Income:\nNotes","Additional Expenditure \ndue (not on report)","Additional Expenditure:\nNotes"]
[0,0,{"v":0,"d":"0.00"},{"v":0,"d":"0.00"},null,{"$f":"Data!B2","v":101},{"$f":"Data!C2","v":"Admin/Clerical Staff Costs"},{"$f":"Data!D2","v":{"v":582920,"d":"582920.00"}},{"$f":"Data!H2","v":-28105.23},"",0,"",0,""]
[0,0,{"v":0,"d":"0.00"},{"v":0,"d":"0.00"},null,{"$f":"Data!B3","v":102},{"$f":"Data!C3","v":"Catering Staff"},{"$f":"Data!D3","v":{"v":0,"d":"0.00"}},{"$f":"Data!H3","v":{"v":0,"d":"0.00"}},"",0,"",0,""]
[0,0,{"v":0,"d":"0.00"},{"v":0,"d":"0.00"},null,{"$f":"Data!B4","v":103},{"$f":"Data!C4","v":"Foreign Assistant"},{"$f":"Data!D4","v":{"v":0,"d":"0.00"}},{"$f":"Data!H4","v":{"v":0,"d":"0.00"}},"",0,"",0,""]
[0,0,{"v":0,"d":"0.00"},{"v":0,"d":"0.00"},null,{"$f":"Data!B5","v":104},{"$f":"Data!C5","v":"Vending Staff"},{"$f":"Data!D5","v":{"v":0,"d":"0.00"}},{"$f":"Data!H5","v":{"v":0,"d":"0.00"}},"",0,"",0,""]
[0,0,{"v":0,"d":"0.00"},{"v":0,"d":"0.00"},null,{"$f":"Data!B6","v":105},{"$f":"Data!C6","v":"Premises Staff"},{"$f":"Data!D6","v":{"v":169494,"d":"169494.00"}},{"$f":"Data!H6","v":287.08},"",0,"",0,""]
[0,0,{"v":0,"d":"0.00"},{"v":0,"d":"0.00"},null,{"$f":"Data!B7","v":106},{"$f":"Data!C7","v":"Midday Supervisors"},{"$f":"Data!D7","v":{"v":4100,"d":"4100.00"}},{"$f":"Data!H7","v":320.28},"",0,"",0,""]
[0,0,{"v":0,"d":"0.00"},{"v":0,"d":"0.00"},null,{"$f":"Data!B8","v":107},{"$f":"Data!C8","v":"Music Peri Teachers"},{"$f":"Data!D8","v":{"v":0,"d":"0.00"}},{"$f":"Data!H8","v":{"v":0,"d":"0.00"}},"",0,"",0,""]
[0,0,{"v":0,"d":"0.00"},{"v":0,"d":"0.00"},null,{"$f":"Data!B9","v":108},{"$f":"Data!C9","v":"Teachers-Main Scale"},{"$f":"Data!D9","v":{"v":3260397,"d":"3260397.00"}},{"$f":"Data!H9","v":-40906.05},"",0,"",0,""]
[0,0,{"v":0,"d":"0.00"},{"v":0,"d":"0.00"},null,{"$f":"Data!B10","v":112},{"$f":"Data!C10","v":"Leadership"},{"$f":"Data!D10","v":{"v":903542,"d":"903542.00"}},{"$f":"Data!H10","v":1425.98},"",0,"",0,""]
[0,0,{"v":0,"d":"0.00"},{"v":0,"d":"0.00"},null,{"$f":"Data!B11","v":113},{"$f":"Data!C11","v":"Unqual Teachers"},{"$f":"Data!D11","v":{"v":45162,"d":"45162.00"}},{"$f":"Data!H11","v":{"v":-330.7,"d":"-330.70"}},"",0,"",0,""]
[0,0,{"v":0,"d":"0.00"},{"v":0,"d":"0.00"},null,{"$f":"Data!B12","v":114},{"$f":"Data!C12","v":"Cover Supervisors"},{"$f":"Data!D12","v":{"v":21624,"d":"21624.00"}},{"$f":"Data!H12","v":34.69},"",0,"",0,""]
[0,0,{"v":0,"d":"0.00"},{"v":0,"d":"0.00"},null,{"$f":"Data!B13","v":115},{"$f":"Data!C13","v":"Pastoral Staff"},{"$f":"Data!D13","v":{"v":382270,"d":"382270.00"}},{"$f":"Data!H13","v":1528.41},"",0,"",0,""]
[0,0,{"v":0,"d":"0.00"},{"v":0,"d":"0.00"},null,{"$f":"Data!B14","v":116},{"$f":"Data!C14","v":"Dept Technicians"},{"$f":"Data!D14","v":{"v":108466,"d":"108466.00"}},{"$f":"Data!H14","v":171.64},"",0,"",0,""]
[0,0,{"v":0,"d":"0.00"},{"v":0,"d":"0.00"},null,{"$f":"Data!B15","v":117},{"$f":"Data!C15","v":"LSA"},{"$f":"Data!D15","v":{"v":176943,"d":"176943.00"}},{"$f":"Data!H15","v":24987.54},"",0,"",0,""]
[0,0,{"v":0,"d":"0.00"},{"v":0,"d":"0.00"},null,{"$f":"Data!B16","v":118},{"$f":"Data!C16","v":"IT Technicians"},{"$f":"Data!D16","v":{"v":75954,"d":"75954.00"}},{"$f":"Data!H16","v":-53.69},"",0,"",0,""]
[0,0,{"v":0,"d":"0.00"},{"v":0,"d":"0.00"},null,{"$f":"Data!B17","v":120},{"$f":"Data!C17","v":"Science Technicians"},{"$f":"Data!D17","v":{"v":83803,"d":"83803.00"}},{"$f":"Data!H17","v":{"v":10189.3,"d":"10189.30"}},"",0,"",0,""]
[0,0,{"v":0,"d":"0.00"},{"v":0,"d":"0.00"},null,{"$f":"Data!B18","v":121},{"$f":"Data!C18","v":"Library Staff"},{"$f":"Data!D18","v":{"v":33974,"d":"33974.00"}},{"$f":"Data!H18","v":1047.34},"",0,"",0,""]
[0,0,{"v":0,"d":"0.00"},{"v":0,"d":"0.00"},null,{"$f":"Data!B19","v":122},{"$f":"Data!C19","v":"Student Services"},{"$f":"Data!D19","v":{"v":42956,"d":"42956.00"}},{"$f":"Data!H19","v":296.98},"",0,"",0,""]
[0,0,{"v":0,"d":"0.00"},{"v":0,"d":"0.00"},null,{"$f":"Data!B20","v":150},{"$f":"Data!C20","v":"Supply Cost"},{"$f":"Data!D20","v":{"v":20000,"d":"20000.00"}},{"$f":"Data!H20","v":{"v":-12187,"d":"-12187.00"}},"",0,"",0,""]
[0,0,{"v":0,"d":"0.00"},{"v":0,"d":"0.00"},null,{"$f":"Data!B21","v":151},{"$f":"Data!C21","v":"Other Staff Cost"},{"$f":"Data!D21","v":{"v":5000,"d":"5000.00"}},{"$f":"Data!H21","v":{"v":1171.4,"d":"1171.40"}},"",0,"",0,""]
{"$rows_left_out":222}