{"text_format":"3","workbook":"xlsx","n_sheets":7,"sheets":["Introduction and outcomes","Checklist","Dashboard","Optional - input raw data","RAG rating data for your school","RAG rating data for all schools","Calcs"],"not_rendered":{"macros":1,"defined_names":92},"read":"whole","date_system":"1900"}

{"sheet":"Introduction and outcomes","index":0,"n_rows":20,"n_cols":15,"rows_kept":20,"merged":[[2,2,2,19],[4,2,4,19],[5,2,5,19],[6,2,6,19],[7,2,7,19],[10,2,10,19],[12,2,12,19],[13,2,13,19],[15,2,15,10],[15,11,15,13],[15,14,15,18],[17,2,17,10],[17,11,17,13],[19,2,19,10],[19,11,19,13],[21,2,21,9]]}
[]
[]
[null,null,"Introduction to the schools resource management self-assessment tool"]
[]
[null,null,"The school resource management self-assessment tool helps to provide trusts with assurance that they are meeting the basic standards necessary to achieve a good\nlevel of financial health and resource management. \n\nThe tool can be used to identify possible areas for change to ensure that resources are being used to support high-quality teaching and the best education outcomes for pupils. The tool is in two parts:"]
[null,null,"1. A checklist, which asks a number of questions of trust boards in six areas of resource management to provide assurance that the trust  is managing its resources effectively. This should be completed at trust level."]
[null,null,"2. A dashboard, which shows how a school's data compares to thresholds on a range of statistics that have been identified as indicators for good resource management and outcomes. This should be completed at school level."]
[null,null,"From autumn 2019, completion of the self-assessment tool is compulsory for all academy trusts. The checklist must be submitted to the ESFA using the online form, which will be made available in October. The dashboard must be completed but trusts are not required to submit it."]
[]
[]
[null,null,"Outcome of school resource management self-assessment"]
[]
[null,null,"Summary of agreed action and timetable for reporting back:"]
[null,null,"\n[enter text]"]
[]
[null,null,"Signature:",{"$nulls":11},"Chair of trust board"]
[]
[null,null,"Full name of signatory:"]
[]
[null,null,"Date self-assessment agreed:"]

{"sheet":"Checklist","index":1,"n_rows":70,"n_cols":17,"rows_kept":70,"merged":[[2,2,2,16],[4,2,4,16],[5,2,5,16],[6,2,6,16],[8,2,9,5],[8,6,9,16],[12,2,12,16],[14,3,14,9],[15,3,15,9],[16,3,16,9],[17,3,17,9],[18,3,18,9],[19,3,19,9],[20,3,20,9],[21,3,21,9],[22,3,22,9],[23,3,23,9],[24,3,24,9],[25,3,25,9],[27,2,27,16],[29,3,29,9],[30,3,30,9],[31,3,31,9],[32,3,32,9],[33,3,33,9],[34,3,34,9],[36,2,36,16],[38,3,38,9],[39,3,39,9],[40,3,40,9],[41,3,41,9],[42,3,42,9],[44,2,44,16],[46,3,46,9],[47,3,47,9],[48,3,48,9],[50,2,50,16],[52,3,52,9],[53,3,53,9],[54,3,54,9],[55,3,55,9],[56,3,56,9],[57,3,57,9],[59,2,59,16],[61,3,61,9],[62,3,62,9],[63,3,63,9],[64,3,64,9],[65,3,65,9],[67,2,67,16],[69,3,69,9],[71,2,71,9]]}
[]
[]
[null,null,"School resource management self-assessment checklist"]
[]
[null,null,"The checklist asks a number of questions of trust boards in six areas of resource management to help provide assurance that resources are being managed effectively. \n\nThe mandatory return of the self-assessment tool must be submitted to the ESFA using an online form. The online form will be available in October. The deadline for submission is 14 November 2019. This downloaded form can be used to prepare for the return or to assess use of resources at various points throughout the year.\n\nThe checklist should be completed at academy trust level. "]
[null,null,"Guidance on completion of this document can be found here. This guidance also includes examples of good practice and details further support available to assist trusts in addressing specific issues. Clicking on the individual questions below will also take you to the relevant section of the guidance. "]
[null,null,"Trusts should answer each question with 'yes', 'no', or 'in part' from the drop down lists provided. If a trust answers 'no' or 'in part' to a question, they must provide a target date and comments. Trusts may also provide comments, evidence and proposed actions for 'yes' answers."]
[]
[null,null,"Trust name:",{"$nulls":3},"Shenfield High School"]
[]
[]
[{"$nulls":12},"Answer\n(yes, in part, no)",null,"Target date",null,"Comments, evidence and proposed actions"]
[null,null,"A. Governance"]
[]
[null,null,1,"Has the board assessed its composition during the year in terms of skills, effectiveness, leadership and impact?",{"$nulls":6},"Q1 guidance",null,"Yes"]
[null,null,2,"Has the board got a plan in place to address any gaps in its capabilities through recruitment, induction, training or other development activity?",{"$nulls":6},"Q2 guidance",null,"Yes"]
[null,null,3,"Has the board appointed the senior executive leader as accounting officer?",{"$nulls":6},"Q3 guidance",null,"Yes"]
[null,null,4,"Has the board appointed a qualified and/or experienced chief financial officer?",{"$nulls":6},"Q4 guidance",null,"Yes"]
[null,null,5,"Has the board appointed a clerk who is someone other than a trustee, principal or chief executive of the trust?",{"$nulls":6},"Q5 guidance",null,"Yes"]
[null,null,"6A","How many times has the board met in the last year?",{"$nulls":6},"Q6 guidance",null,5]
[null,null,"6B","If less than 6 times, has the board explained in the governance statement how it has maintained effective oversight?\n(Not applicable answer available)",{"$nulls":6},"Q6 guidance",null,"Yes",{"$nulls":3},"This will be documented in the financial statements "]
[null,null,7,"Has the board approved a written scheme of financial delegations?",{"$nulls":6},"Q7 guidance",null,"Yes",{"$nulls":3},"In the Financial Regulations"]
[null,null,8,"Does the trust have a finance committee (or equivalent) with clear terms of reference and a knowledgeable and experienced chair?",{"$nulls":6},"Q8 guidance",null,"Yes"]
[null,null,9,"Does the trust have an audit committee?",{"$nulls":6},"Q9 guidance",null,"Yes",{"$nulls":3},"Within Resources ToR"]
[null,null,10,"Are there arrangements in place to manage conflict of interest or any related party transactions?",{"$nulls":6},"Q10 guidance",null,"Yes"]
[null,null,11,"Has the trust published its governance arrangements on its website in accordance with the Academies Financial Handbook?",{"$nulls":6},"Q11 guidance",null,"Yes"]
[{"$nulls":12},{"$f":"IF(OR(ROUND(SUM(M15:M26),3)=100%,SUM(M15:M26)=0),\"\",\"Section must sum to 100%\")","v":"Section must sum to 100%"}]
[null,null,"B. Trust financial strategy"]
[]
[null,null,12,"Can the trust evidence that its 3-year financial forecast has been reviewed by the trustees before approval?",{"$nulls":6},"Q12 guidance",null,"Yes"]
[null,null,13,"Can the trust evidence that trustees have taken financial performance in previous years into account (e.g. adjustments for areas of significant underspend or overspend)?",{"$nulls":6},"Q13 guidance",null,"Yes"]
[null,null,14,"Are the assumptions behind the 3-year forecast, including pupil number projections, documented?",{"$nulls":6},"Q14 guidance",null,"Yes"]
[null,null,15,"If a cumulative deficit has been forecast within the 3-year budget, is there a plan to mitigate it?\n(Not applicable answer available)",{"$nulls":6},"Q15 guidance",null,"Not applicable"]
[null,null,16,"Is the financial strategy integrated with the trust's strategy for raising standards and attainment?",{"$nulls":6},"Q16 guidance",null,"Yes"]
[null,null,17,"Does the trust have an appropriate business continuity or disaster recovery plan, including an up-to-date asset register and adequate insurance?",{"$nulls":6},"Q17 guidance",null,"Yes"]
[{"$nulls":12},{"$f":"IF(OR(ROUND(SUM(M27:M33),3)=100%,SUM(M27:M33)=0),\"\",\"Section must sum to 100%\")","v":""}]
[null,null,"C. Setting the annual budget"]
[]
[null,null,18,"Does the trust set a well-informed and balanced budget each year?",{"$nulls":6},"Q18 guidance",null,"Yes"]
[null,null,19,"Does the budget setting process allow sufficient time for the trust board to scrutinise and challenge the information provided?",{"$nulls":6},"Q19 guidance",null,"Yes"]
[null,null,20,"Is the trust realistic in its pupil number projections and can it move quickly to recast the budget if the projections and the reality are materially different?",{"$nulls":6},"Q20 guidance",null,"Yes"]
[null,null,21,"Is end year outturn in line with budget projections, or if not, is the trust board alerted to significant variations in a timely manner, and do they result from explicitly planned changes or from genuinely unforeseeable circumstances?",{"$nulls":6},"Q21 guidance",null,"Yes"]
[null,null,22,"Are balances at a reasonable level and does the trust have a clear plan for using the money it plans to hold in balance at the end of each year?",{"$nulls":6},"Q22 guidance",null,"Yes"]
[{"$nulls":12},{"$f":"IF(OR(ROUND(SUM(M37:M43),3)=100%,SUM(M37:M43)=0),\"\",\"Section must sum to 100%\")","v":""}]
[null,null,"D. Staffing"]
[]
[null,null,23,"Does the trust review and challenge its staffing structure regularly to ensure it is the best structure to meet the needs of the trust whilst maintaining financial integrity? ",{"$nulls":6},"Q23 guidance",null,"Yes"]
[null,null,24,"Is the pay of senior leaders tightly correlated to strong educational outcomes and sound financial management?",{"$nulls":6},"Q24 guidance",null,"Yes"]
[null,null,25,"Does the trust benchmark the size of its senior leadership team annually against that of similar schools?",{"$nulls":6},"Q25 guidance",null,"Yes",{"$nulls":3},"As well as the operational needs of the school"]
[{"$nulls":12},{"$f":"IF(OR(ROUND(SUM(M43:M49),3)=100%,SUM(M43:M49)=0),\"\",\"Section must sum to 100%\")","v":""}]
[null,null,"E. Value for money"]
[]
[null,null,26,"Does the trust benchmark its income and expenditure and that of its schools annually against that of similar schools and investigate further where any category appears to be out of line?",{"$nulls":6},"Q26 guidance",null,"Yes"]
[null,null,27,"Does the trust have procedures for purchasing goods and services that both meet legal requirements and secure value for money?",{"$nulls":6},"Q27 guidance",null,"Yes"]
[null,null,28,"Are the trustees given the opportunity to challenge their staff’s  plans for replacing contracts for goods and services that are due to expire shortly?",{"$nulls":6},"Q28 guidance",null,"Yes",{"$nulls":3},"On major contracts such as catering and cleaning, trustee representatives are included on the decision making committee. Smaller contracts are negotiated on an operational level and reviewed by trustees on the Resources committee regularly."]
[null,null,29,"Does the trust consider collaboration with others, for example on sharing staff or joint purchasing, where that would improve value for money?",{"$nulls":6},"Q29 guidance",null,"Yes",{"$nulls":3},"GDPR support negotiated ASHE discount. "]
[null,null,30,"Does the trust compare its non-staff expenditure against the DfE recommended national deals to ensure you are achieving best value for money?",{"$nulls":6},"Q30 guidance",null,"Yes",{"$nulls":3},"Purchasing frameworks and consortiums"]
[null,null,31,"Does the trust maintain its premises and other assets to an adequate standard and make best use of capital monies for this purpose?",{"$nulls":6},"Q31 guidance",null,"Yes"]
[{"$nulls":12},{"$f":"IF(OR(ROUND(SUM(M54:M58),3)=100%,SUM(M54:M58)=0),\"\",\"Section must sum to 100%\")","v":""}]
[null,null,"F. Protecting public money "]
[]
[null,null,32,"Are the trustees sure that there are no outstanding matters from audit reports?",{"$nulls":6},"Q32 guidance",null,"Yes"]
[null,null,33,"Are the internal scrutiny arrangements, as defined in the Academies Financial Handbook, adhered to?",{"$nulls":6},"Q33 guidance",null,"Yes"]
[null,null,34,"Are there adequate arrangements in place to guard against fraud and theft by staff, contractors and suppliers?",{"$nulls":6},"Q34 guidance",null,"Yes"]
[null,null,35,"Are all staff aware of the trust’s whistleblowing arrangements and to whom they should report concerns?",{"$nulls":6},"Q35 guidance",null,"Yes"]
[null,null,36,"Does the trust have an accounting system that is adequate and properly run and delivers accurate reports, including the required returns to ESFA?",{"$nulls":6},"Q36 guidance",null,"Yes"]
[{"$nulls":12},{"$f":"IF(OR(ROUND(SUM(M63:M66),3)=100%,SUM(M63:M66)=0),\"\",\"Section must sum to 100%\")","v":""}]
[null,null,"G. Self-assessment dashboard"]
[]
[null,null,37,"Have the results of the self-assessment dashboard been carefully considered and potential follow-up actions identified?\n(Not applicable for sixth form colleges)",{"$nulls":6},"Q37 guidance"]

{"sheet":"Dashboard","index":2,"n_rows":73,"n_cols":84,"rows_kept":73,"merged":[[2,2,2,3],[4,2,8,3],[10,2,10,3],[12,2,17,3],[12,5,12,6],[12,9,12,10],[12,13,12,14],[12,17,12,18],[12,21,12,22],[12,25,12,26],[12,29,12,30],[12,33,12,34],[12,37,12,38],[12,41,12,42],[12,45,12,46],[12,49,12,50],[12,53,12,54],[12,57,12,58],[12,61,12,62],[12,65,12,66],[12,69,12,70],[12,73,12,74],[12,77,12,78],[12,81,12,82],[13,5,13,6],[13,9,13,10],[13,13,13,14],[13,17,13,18],[13,21,13,22],[13,25,13,26],[13,29,13,30],[13,33,13,34],[13,37,13,38],[13,41,13,42],[13,45,13,46],[13,49,13,50],[13,53,13,54],[13,57,13,58],[13,61,13,62],[13,65,13,66],[13,69,13,70],[13,73,13,74],[13,77,13,78],[13,81,13,82],[14,5,14,6],[14,9,14,10],[14,13,14,14],[14,17,14,18],[14,21,14,22],[14,25,14,26],[14,29,14,30],[14,33,14,34],[14,37,14,38],[14,41,14,42],[14,45,14,46],[14,49,14,50],[14,53,14,54],[14,57,14,58],[14,61,14,62],[14,65,14,66],[14,69,14,70],[14,73,14,74],[14,77,14,78],[14,81,14,82],[15,5,15,6],[15,9,15,10],[15,13,15,14],[15,17,15,18],[15,21,15,22],[15,25,15,26],[15,29,15,30],[15,33,15,34],[15,37,15,38],[15,41,15,42],[15,45,15,46],[15,49,15,50],[15,53,15,54],[15,57,15,58],[15,61,15,62],[15,65,15,66],[15,69,15,70],[15,73,15,74],[15,77,15,78],[15,81,15,82],[16,5,16,6],[16,9,16,10],[16,13,16,14],[16,17,16,18],[16,21,16,22],[16,25,16,26],[16,29,16,30],[16,33,16,34],[16,37,16,38],[16,41,16,42],[16,45,16,46],[16,49,16,50],[16,53,16,54],[16,57,16,58],[16,61,16,62],[16,65,16,66],[16,69,16,70],[16,73,16,74],[16,77,16,78],[16,81,16,82],[18,2,20,3],[18,5,18,7],[18,9,18,11],[18,13,18,15],[18,17,18,19],[18,21,18,23],[18,25,18,27],[18,29,18,31],[18,33,18,35],[18,37,18,39],[18,41,18,43],[18,45,18,47],[18,49,18,51],[18,53,18,55],[18,57,18,59],[18,61,18,63],[18,65,18,67],[18,69,18,71],[18,73,18,75],[18,77,18,79],[18,81,18,83],[19,5,20,7],[19,9,20,11],[19,13,20,15],[19,17,20,19],[19,21,20,23],[19,25,20,27],[19,29,20,31],[19,33,20,35],[19,37,20,39],[19,41,20,43],[19,45,20,47],[19,49,20,51],[19,53,20,55],[19,57,20,59],[19,61,20,63],[19,65,20,67],[19,69,20,71],[19,73,20,75],[19,77,20,79],[19,81,20,83],[21,2,23,3],[21,5,22,7],[21,9,22,11],[21,13,22,15],[21,17,22,19],[21,21,22,23],[21,25,22,27],[21,29,22,31],[21,33,22,35],[21,37,22,39],[21,41,22,43],[21,45,22,47],[21,49,22,51],[21,53,22,55],[21,57,22,59],[21,61,22,63],[21,65,22,67],[21,69,22,71],[21,73,22,75],[21,77,22,79],[21,81,22,83],[24,2,26,3],[24,5,24,7],[26,5,28,7],[26,9,28,11],[26,13,28,15],[26,17,28,19],[26,21,28,23],[26,25,28,27],[26,29,28,31],[26,33,28,35],[26,37,28,39],[26,41,28,43],[26,45,28,47],[26,49,28,51],[26,53,28,55],[26,57,28,59],[26,61,28,63],[26,65,28,67],[26,69,28,71],[26,73,28,75],[26,77,28,79],[26,81,28,83],[28,2,31,3],[29,5,30,7],[29,9,30,11],[29,13,30,15],[29,17,30,19],[29,21,30,23],[29,25,30,27],[29,29,30,31],[29,33,30,35],[29,37,30,39],[29,41,30,43],[29,45,30,47],[29,49,30,51],[29,53,30,55],[29,57,30,59],[29,61,30,63],[29,65,30,67],[29,69,30,71],[29,73,30,75],[29,77,30,79],[29,81,30,83],[33,5,34,5],[33,7,34,7],[33,9,34,9],[33,11,34,11],[33,13,34,13],[33,15,34,15],[33,17,34,17],[33,19,34,19],[33,21,34,21],[33,23,34,23],[33,25,34,25],[33,27,34,27],[33,29,34,29],[33,31,34,31],[33,33,34,33],[33,35,34,35],[33,37,34,37],[33,39,34,39],[33,41,34,41],[33,43,34,43],[33,45,34,45],[33,47,34,47],[33,49,34,49],[33,51,34,51],[33,53,34,53],[33,55,34,55],[33,57,34,57],[33,59,34,59],[33,61,34,61],[33,63,34,63],[33,65,34,65],[33,67,34,67],[33,69,34,69],[33,71,34,71],[33,73,34,73],[33,75,34,75],[33,77,34,77],[33,79,34,79],[33,81,34,81],[33,83,34,83],[35,2,35,3],[47,2,47,3],[52,2,52,3],[62,2,62,3],[70,2,70,3],[72,2,78,3],[72,5,78,7],[72,9,78,11],[72,13,78,15],[72,17,78,19],[72,21,78,23],[72,25,78,27],[72,29,78,31],[72,33,78,35],[72,37,78,39],[72,41,78,43],[72,45,78,47],[72,49,78,51],[72,53,78,55],[72,57,78,59],[72,61,78,63],[72,65,78,67],[72,69,78,71],[72,73,78,75],[72,77,78,79],[72,81,78,83]]}
[]
[]
[null,null,"School resource management self-assessment dashboard"]
[]
[null,null,"Effective resource management is about how a trust uses its resources to drive outcomes for its pupils. A trust can improve outcomes by using its resources more effectively.\n \nThe dashboard below is designed to help trusts identify areas for improved resource management. It shows how a school compares to thresholds on a range of key indicators. "]
[]
[]
[]
[]
[]
[null,null,"A. Information about your school(s)"]
["*",{"$nulls":4},1,{"$nulls":3},2,{"$nulls":3},3,{"$nulls":3},4,{"$nulls":3},5,{"$nulls":3},6,{"$nulls":3},7,{"$nulls":3},8,{"$nulls":3},9,{"$nulls":3},10,{"$nulls":3},11,{"$nulls":3},12,{"$nulls":3},13,{"$nulls":3},14,{"$nulls":3},15,{"$nulls":3},16,{"$nulls":3},17,{"$nulls":3},18,{"$nulls":3},19,{"$nulls":3},20]
[null,null,"\nUsing the dashboard\n\nThe dashboard data should be completed at school level. Sixth form colleges do not need to complete the dashboard.\n \nSchools and trusts should use the most up to date data available to them, and not rely on lagged published data.\n \nComplete all highlighted cells.",null,null,"School name:",null,"Shenfield High School",null,"School name:",{"$nulls":3},"School name:",{"$nulls":3},"School name:",{"$nulls":3},"School name:",{"$nulls":3},"School name:",{"$nulls":3},"School name:",{"$nulls":3},"School name:",{"$nulls":3},"School name:",{"$nulls":3},"School name:",{"$nulls":3},"School name:",{"$nulls":3},"School name:",{"$nulls":3},"School name:",{"$nulls":3},"School name:",{"$nulls":3},"School name:",{"$nulls":3},"School name:",{"$nulls":3},"School name:",{"$nulls":3},"School name:",{"$nulls":3},"School name:",{"$nulls":3},"School name:"]
[{"$nulls":5},"Phase:",null,"Secondary with sixth form",null,"Phase:",{"$nulls":3},"Phase:",{"$nulls":3},"Phase:",{"$nulls":3},"Phase:",{"$nulls":3},"Phase:",{"$nulls":3},"Phase:",{"$nulls":3},"Phase:",{"$nulls":3},"Phase:",{"$nulls":3},"Phase:",{"$nulls":3},"Phase:",{"$nulls":3},"Phase:",{"$nulls":3},"Phase:",{"$nulls":3},"Phase:",{"$nulls":3},"Phase:",{"$nulls":3},"Phase:",{"$nulls":3},"Phase:",{"$nulls":3},"Phase:",{"$nulls":3},"Phase:",{"$nulls":3},"Phase:"]
[{"$nulls":5},"Region:",null,"East of England",null,"Region:",{"$nulls":3},"Region:",{"$nulls":3},"Region:",{"$nulls":3},"Region:",{"$nulls":3},"Region:",{"$nulls":3},"Region:",{"$nulls":3},"Region:",{"$nulls":3},"Region:",{"$nulls":3},"Region:",{"$nulls":3},"Region:",{"$nulls":3},"Region:",{"$nulls":3},"Region:",{"$nulls":3},"Region:",{"$nulls":3},"Region:",{"$nulls":3},"Region:",{"$nulls":3},"Region:",{"$nulls":3},"Region:",{"$nulls":3},"Region:",{"$nulls":3},"Region:"]
[{"$nulls":5},"Number of pupils:",null,1352,null,"Number of pupils:",{"$nulls":3},"Number of pupils:",{"$nulls":3},"Number of pupils:",{"$nulls":3},"Number of pupils:",{"$nulls":3},"Number of pupils:",{"$nulls":3},"Number of pupils:",{"$nulls":3},"Number of pupils:",{"$nulls":3},"Number of pupils:",{"$nulls":3},"Number of pupils:",{"$nulls":3},"Number of pupils:",{"$nulls":3},"Number of pupils:",{"$nulls":3},"Number of pupils:",{"$nulls":3},"Number of pupils:",{"$nulls":3},"Number of pupils:",{"$nulls":3},"Number of pupils:",{"$nulls":3},"Number of pupils:",{"$nulls":3},"Number of pupils:",{"$nulls":3},"Number of pupils:",{"$nulls":3},"Number of pupils:"]
[{"$nulls":5},"% of pupils eligible for FSM:",null,{"v":0.0614,"d":"6.1%"},null,"% of pupils eligible for FSM:",{"$nulls":3},"% of pupils eligible for FSM:",{"$nulls":3},"% of pupils eligible for FSM:",{"$nulls":3},"% of pupils eligible for FSM:",{"$nulls":3},"% of pupils eligible for FSM:",{"$nulls":3},"% of pupils eligible for FSM:",{"$nulls":3},"% of pupils eligible for FSM:",{"$nulls":3},"% of pupils eligible for FSM:",{"$nulls":3},"% of pupils eligible for FSM:",{"$nulls":3},"% of pupils eligible for FSM:",{"$nulls":3},"% of pupils eligible for FSM:",{"$nulls":3},"% of pupils eligible for FSM:",{"$nulls":3},"% of pupils eligible for FSM:",{"$nulls":3},"% of pupils eligible for FSM:",{"$nulls":3},"% of pupils eligible for FSM:",{"$nulls":3},"% of pupils eligible for FSM:",{"$nulls":3},"% of pupils eligible for FSM:",{"$nulls":3},"% of pupils eligible for FSM:",{"$nulls":3},"% of pupils eligible for FSM:"]
[]
[null,null,"Guidance on calculating or collecting the data for the school so that metrics are compared to thresholds consistently can be found here. Clicking on the link next to individual indicators below will also take you to the relevant section of the guidance.",null,null,"This school is being compared to other:",{"$nulls":3},"This school is being compared to other:",{"$nulls":3},"This school is being compared to other:",{"$nulls":3},"This school is being compared to other:",{"$nulls":3},"This school is being compared to other:",{"$nulls":3},"This school is being compared to other:",{"$nulls":3},"This school is being compared to other:",{"$nulls":3},"This school is being compared to other:",{"$nulls":3},"This school is being compared to other:",{"$nulls":3},"This school is being compared to other:",{"$nulls":3},"This school is being compared to other:",{"$nulls":3},"This school is being compared to other:",{"$nulls":3},"This school is being compared to other:",{"$nulls":3},"This school is being compared to other:",{"$nulls":3},"This school is being compared to other:",{"$nulls":3},"This school is being compared to other:",{"$nulls":3},"This school is being compared to other:",{"$nulls":3},"This school is being compared to other:",{"$nulls":3},"This school is being compared to other:",{"$nulls":3},"This school is being compared to other:"]
[{"$nulls":5},{"$f":"IF(OR(H$14=\"\",H$15=\"\",H$16=\"\",H$17=\"\"),\"\",\n\"- \"&Calcs!$J29&\nIF(H14=\"Primary\",\" primary schools with \",IF(H14=\"Secondary with sixth form\",\" secondary schools with a sixth form with \",IF(H14=\"Secondary without sixth form\",\" secondary schools without a sixth form with \",IF(H14=\"Special\",\"special schools\",IF(H14=\"Alternative provision\",\"alternative provision schools\",IF(H14=\"All-through\",\"all-through schools\",IF(H14=\"Nursery\",\"nursery schools\",\"\")))))))&Calcs!$K29)","v":"- large secondary schools with a sixth form with medium levels of FSM"},{"$nulls":3},{"$f":"IF(OR(L$14=\"\",L$15=\"\",L$16=\"\",L$17=\"\"),\"\",\n\"- \"&Calcs!$J30&\nIF(L14=\"Primary\",\" primary schools with \",IF(L14=\"Secondary with sixth form\",\" secondary schools with a sixth form with \",IF(L14=\"Secondary without sixth form\",\" secondary schools without a sixth form with \",IF(L14=\"Special\",\"special schools\",IF(L14=\"Alternative provision\",\"alternative provision schools\",IF(L14=\"All-through\",\"all-through schools\",IF(L14=\"Nursery\",\"nursery schools\",\"\")))))))&Calcs!$K30)","v":""},{"$nulls":3},{"$f":"IF(OR(P$14=\"\",P$15=\"\",P$16=\"\",P$17=\"\"),\"\",\n\"- \"&Calcs!$J31&\nIF(P14=\"Primary\",\" primary schools with \",IF(P14=\"Secondary with sixth form\",\" secondary schools with a sixth form with \",IF(P14=\"Secondary without sixth form\",\" secondary schools without a sixth form with \",IF(P14=\"Special\",\"special schools\",IF(P14=\"Alternative provision\",\"alternative provision schools\",IF(P14=\"All-through\",\"all-through schools\",IF(P14=\"Nursery\",\"nursery schools\",\"\")))))))&Calcs!$K31)","v":""},{"$nulls":3},{"$f":"IF(OR(T$14=\"\",T$15=\"\",T$16=\"\",T$17=\"\"),\"\",\n\"- \"&Calcs!$J32&\nIF(T14=\"Primary\",\" primary schools with \",IF(T14=\"Secondary with sixth form\",\" secondary schools with a sixth form with \",IF(T14=\"Secondary without sixth form\",\" secondary schools without a sixth form with \",IF(T14=\"Special\",\"special schools\",IF(T14=\"Alternative provision\",\"alternative provision schools\",IF(T14=\"All-through\",\"all-through schools\",IF(T14=\"Nursery\",\"nursery schools\",\"\")))))))&Calcs!$K32)","v":""},{"$nulls":3},{"$f":"IF(OR(X$14=\"\",X$15=\"\",X$16=\"\",X$17=\"\"),\"\",\n\"- \"&Calcs!$J33&\nIF(X14=\"Primary\",\" primary schools with \",IF(X14=\"Secondary with sixth form\",\" secondary schools with a sixth form with \",IF(X14=\"Secondary without sixth form\",\" secondary schools without a sixth form with \",IF(X14=\"Special\",\"special schools\",IF(X14=\"Alternative provision\",\"alternative provision schools\",IF(X14=\"All-through\",\"all-through schools\",IF(X14=\"Nursery\",\"nursery schools\",\"\")))))))&Calcs!$K33)","v":""},{"$nulls":3},{"$f":"IF(OR(AB$14=\"\",AB$15=\"\",AB$16=\"\",AB$17=\"\"),\"\",\n\"- \"&Calcs!$J34&\nIF(AB14=\"Primary\",\" primary schools with \",IF(AB14=\"Secondary with sixth form\",\" secondary schools with a sixth form with \",IF(AB14=\"Secondary without sixth form\",\" secondary schools without a sixth form with \",IF(AB14=\"Special\",\"special schools\",IF(AB14=\"Alternative provision\",\"alternative provision schools\",IF(AB14=\"All-through\",\"all-through schools\",IF(AB14=\"Nursery\",\" nursery schools\",\"\")))))))&Calcs!$K34)","v":""},{"$nulls":3},{"$f":"IF(OR(AF$14=\"\",AF$15=\"\",AF$16=\"\",AF$17=\"\"),\"\",\n\"- \"&Calcs!$J35&\nIF(AF14=\"Primary\",\" primary schools with \",IF(AF14=\"Secondary with sixth form\",\" secondary schools with a sixth form with \",IF(AF14=\"Secondary without sixth form\",\" secondary schools without a sixth form with \",IF(AF14=\"Special\",\"special schools\",IF(AF14=\"Alternative provision\",\"alternative provision schools\",IF(AF14=\"All-through\",\"all-through schools\",IF(AF14=\"Nursery\",\"nursery schools\",\"\")))))))&Calcs!$K35)","v":""},{"$nulls":3},{"$f":"IF(OR(AJ$14=\"\",AJ$15=\"\",AJ$16=\"\",AJ$17=\"\"),\"\",\n\"- \"&Calcs!$J36&\nIF(AJ14=\"Primary\",\" primary schools with \",IF(AJ14=\"Secondary with sixth form\",\" secondary schools with a sixth form with \",IF(AJ14=\"Secondary without sixth form\",\" secondary schools without a sixth form with \",IF(AJ14=\"Special\",\"special schools\",IF(AJ14=\"Alternative provision\",\"alternative provision schools\",IF(AJ14=\"All-through\",\"all-through schools\",IF(AJ14=\"Nursery\",\"nursery schools\",\"\")))))))&Calcs!$K36)","v":""},{"$nulls":3},{"$f":"IF(OR(AN$14=\"\",AN$15=\"\",AN$16=\"\",AN$17=\"\"),\"\",\n\"- \"&Calcs!$J37&\nIF(AN14=\"Primary\",\" primary schools with \",IF(AN14=\"Secondary with sixth form\",\" secondary schools with a sixth form with \",IF(AN14=\"Secondary without sixth form\",\" secondary schools without a sixth form with \",IF(AN14=\"Special\",\"special schools\",IF(AN14=\"Alternative provision\",\"alternative provision schools\",IF(AN14=\"All-through\",\"all-through schools\",IF(AN14=\"Nursery\",\"nursery schools\",\"\")))))))&Calcs!$K37)","v":""},{"$nulls":3},{"$f":"IF(OR(AR$14=\"\",AR$15=\"\",AR$16=\"\",AR$17=\"\"),\"\",\n\"- \"&Calcs!$J38&\nIF(AR14=\"Primary\",\" primary schools with \",IF(AR14=\"Secondary with sixth form\",\" secondary schools with a sixth form with \",IF(AR14=\"Secondary without sixth form\",\" secondary schools without a sixth form with \",IF(AR14=\"Special\",\"special schools\",IF(AR14=\"Alternative provision\",\"alternative provision schools\",IF(AR14=\"All-through\",\"all-through schools\",IF(AR14=\"Nursery\",\"nursery schools\",\"\")))))))&Calcs!$K38)","v":""},{"$nulls":3},{"$f":"IF(OR(AV$14=\"\",AV$15=\"\",AV$16=\"\",AV$17=\"\"),\"\",\n\"- \"&Calcs!$J39&\nIF(AV14=\"Primary\",\" primary schools with \",IF(AV14=\"Secondary with sixth form\",\" secondary schools with a sixth form with \",IF(AV14=\"Secondary without sixth form\",\" secondary schools without a sixth form with \",IF(AV14=\"Special\",\"special schools\",IF(AV14=\"Alternative provision\",\"alternative provision schools\",IF(AV14=\"All-through\",\"all-through schools\",IF(AV14=\"Nursery\",\"nursery schools\",\"\")))))))&Calcs!$K39)","v":""},{"$nulls":3},{"$f":"IF(OR(AZ$14=\"\",AZ$15=\"\",AZ$16=\"\",AZ$17=\"\"),\"\",\n\"- \"&Calcs!$J40&\nIF(AZ14=\"Primary\",\" primary schools with \",IF(AZ14=\"Secondary with sixth form\",\" secondary schools with a sixth form with \",IF(AZ14=\"Secondary without sixth form\",\" secondary schools without a sixth form with \",IF(AZ14=\"Special\",\"special schools\",IF(AZ14=\"Alternative provision\",\"alternative provision schools\",IF(AZ14=\"All-through\",\"all-through schools\",IF(AZ14=\"Nursery\",\"nursery schools\",\"\")))))))&Calcs!$K40)","v":""},{"$nulls":3},{"$f":"IF(OR(BD$14=\"\",BD$15=\"\",BD$16=\"\",BD$17=\"\"),\"\",\n\"- \"&Calcs!$J41&\nIF(BD14=\"Primary\",\" primary schools with \",IF(BD14=\"Secondary with sixth form\",\" secondary schools with a sixth form with \",IF(BD14=\"Secondary without sixth form\",\" secondary schools without a sixth form with \",IF(BD14=\"Special\",\"special schools\",IF(BD14=\"Alternative provision\",\"alternative provision schools\",IF(BD14=\"All-through\",\"all-through schools\",IF(BD14=\"Nursery\",\"nursery schools\",\"\")))))))&Calcs!$K41)","v":""},{"$nulls":3},{"$f":"IF(OR(BH$14=\"\",BH$15=\"\",BH$16=\"\",BH$17=\"\"),\"\",\n\"- \"&Calcs!$J42&\nIF(BH14=\"Primary\",\" primary schools with \",IF(BH14=\"Secondary with sixth form\",\" secondary schools with a sixth form with \",IF(BH14=\"Secondary without sixth form\",\" secondary schools without a sixth form with \",IF(BH14=\"Special\",\"special schools\",IF(BH14=\"Alternative provision\",\"alternative provision schools\",IF(BH14=\"All-through\",\"all-through schools\",IF(BH14=\"Nursery\",\"nursery schools\",\"\")))))))&Calcs!$K42)","v":""},{"$nulls":3},{"$f":"IF(OR(BL$14=\"\",BL$15=\"\",BL$16=\"\",BL$17=\"\"),\"\",\n\"- \"&Calcs!$J43&\nIF(BL14=\"Primary\",\" primary schools with \",IF(BL14=\"Secondary with sixth form\",\" secondary schools with a sixth form with \",IF(BL14=\"Secondary without sixth form\",\" secondary schools without a sixth form with \",IF(BL14=\"Special\",\"special schools\",IF(BL14=\"Alternative provision\",\"alternative provision schools\",IF(BL14=\"All-through\",\"all-through schools\",IF(BL14=\"Nursery\",\"nursery schools\",\"\")))))))&Calcs!$K43)","v":""},{"$nulls":3},{"$f":"IF(OR(BP$14=\"\",BP$15=\"\",BP$16=\"\",BP$17=\"\"),\"\",\n\"- \"&Calcs!$J44&\nIF(BP14=\"Primary\",\" primary schools with \",IF(BP14=\"Secondary with sixth form\",\" secondary schools with a sixth form with \",IF(BP14=\"Secondary without sixth form\",\" secondary schools without a sixth form with \",IF(BP14=\"Special\",\"special schools\",IF(BP14=\"Alternative provision\",\"alternative provision schools\",IF(BP14=\"All-through\",\"all-through schools\",IF(BP14=\"Nursery\",\"nursery schools\",\"\")))))))&Calcs!$K44)","v":""},{"$nulls":3},{"$f":"IF(OR(BT$14=\"\",BT$15=\"\",BT$16=\"\",BT$17=\"\"),\"\",\n\"- \"&Calcs!$J45&\nIF(BT14=\"Primary\",\" primary schools with \",IF(BT14=\"Secondary with sixth form\",\" secondary schools with a sixth form with \",IF(BT14=\"Secondary without sixth form\",\" secondary schools without a sixth form with \",IF(BT14=\"Special\",\"special schools\",IF(BT14=\"Alternative provision\",\"alternative provision schools\",IF(BT14=\"All-through\",\"all-through schools\",IF(BT14=\"Nursery\",\"nursery schools\",\"\")))))))&Calcs!$K45)","v":""},{"$nulls":3},{"$f":"IF(OR(BX$14=\"\",BX$15=\"\",BX$16=\"\",BX$17=\"\"),\"\",\n\"- \"&Calcs!$J46&\nIF(BX14=\"Primary\",\" primary schools with \",IF(BX14=\"Secondary with sixth form\",\" secondary schools with a sixth form with \",IF(BX14=\"Secondary without sixth form\",\" secondary schools without a sixth form with \",IF(BX14=\"Special\",\"special schools\",IF(BX14=\"Alternative provision\",\"alternative provision schools\",IF(BX14=\"All-through\",\"all-through schools\",IF(BX14=\"Nursery\",\"nursery schools\",\"\")))))))&Calcs!$K46)","v":""},{"$nulls":3},{"$f":"IF(OR(CB$14=\"\",CB$15=\"\",CB$16=\"\",CB$17=\"\"),\"\",\n\"- \"&Calcs!$J47&\nIF(CB14=\"Primary\",\" primary schools with \",IF(CB14=\"Secondary with sixth form\",\" secondary schools with a sixth form with \",IF(CB14=\"Secondary without sixth form\",\" secondary schools without a sixth form with \",IF(CB14=\"Special\",\"special schools\",IF(CB14=\"Alternative provision\",\"alternative provision schools\",IF(CB14=\"All-through\",\"all-through schools\",IF(CB14=\"Nursery\",\"nursery schools\",\"\")))))))&Calcs!$K47)","v":""},{"$nulls":3},{"$f":"IF(OR(CF$14=\"\",CF$15=\"\",CF$16=\"\",CF$17=\"\"),\"\",\n\"- \"&Calcs!$J48&\nIF(CF14=\"Primary\",\" primary schools with \",IF(CF14=\"Secondary with sixth form\",\" secondary schools with a sixth form with \",IF(CF14=\"Secondary without sixth form\",\" secondary schools without a sixth form with \",IF(CF14=\"Special\",\"special schools\",IF(CF14=\"Alternative provision\",\"alternative provision schools\",IF(CF14=\"All-through\",\"all-through schools\",IF(CF14=\"Nursery\",\"nursery schools\",\"\")))))))&Calcs!$K48)","v":""}]
[]
[null,null,"Either input the school's percentages and ratios directly, or complete the Optional - input raw data form with spending information and school characteristics. The percentages and ratios in the dashboard will then auto-calculate.",null,null,{"$f":"IF(OR(H$14=\"\",H$15=\"\",H$16=\"\",H$17=\"\"),\"\",\nIF(H14=\"Primary\",\"- primary schools \",IF(H14=\"Secondary with sixth form\",\"- secondary schools with a sixth form \",IF(H14=\"Secondary without sixth form\",\"- secondary schools without a sixth form \",IF(H14=\"Special\",\"- special schools \",IF(H14=\"Alternative provision\",\"- alternative provision schools \",IF(H14=\"All-through\",\"- all-through schools \",IF(H14=\"Nursery\",\"- nursery schools \",\"\")))))))&Calcs!$I29&\" (for average teacher cost only)\")","v":"- secondary schools with a sixth form outside London (for average teacher cost only)"},{"$nulls":3},{"$f":"IF(OR(L$14=\"\",L$15=\"\",L$16=\"\",L$17=\"\"),\"\",\nIF(L14=\"Primary\",\"- primary schools \",IF(L14=\"Secondary with sixth form\",\"- secondary schools with a sixth form \",IF(L14=\"Secondary without sixth form\",\"- secondary schools without a sixth form \",IF(L14=\"Special\",\"- special schools \",IF(L14=\"Alternative provision\",\"- alternative provision schools \",IF(L14=\"All-through\",\"- all-through schools \",IF(L14=\"Nursery\",\"- nursery schools \",\"\")))))))&Calcs!$I30&\" (for average teacher cost only)\")","v":""},{"$nulls":3},{"$f":"IF(OR(P$14=\"\",P$15=\"\",P$16=\"\",P$17=\"\"),\"\",\nIF(P14=\"Primary\",\"- primary schools \",IF(P14=\"Secondary with sixth form\",\"- secondary schools with a sixth form \",IF(P14=\"Secondary without sixth form\",\"- secondary schools without a sixth form \",IF(P14=\"Special\",\"- special schools \",IF(P14=\"Alternative provision\",\"- alternative provision schools \",IF(P14=\"All-through\",\"- all-through schools \",IF(P14=\"Nursery\",\"- nursery schools \",\"\")))))))&Calcs!$I31&\" (for average teacher cost only)\")","v":""},{"$nulls":3},{"$f":"IF(OR(T$14=\"\",T$15=\"\",T$16=\"\",T$17=\"\"),\"\",\nIF(T14=\"Primary\",\"- primary schools \",IF(T14=\"Secondary with sixth form\",\"- secondary schools with a sixth form \",IF(T14=\"Secondary without sixth form\",\"- secondary schools without a sixth form \",IF(T14=\"Special\",\"- special schools \",IF(T14=\"Alternative provision\",\"- alternative provision schools \",IF(T14=\"All-through\",\"- all-through schools \",IF(T14=\"Nursery\",\"- nursery schools \",\"\")))))))&Calcs!$I32&\" (for average teacher cost only)\")","v":""},{"$nulls":3},{"$f":"IF(OR(X$14=\"\",X$15=\"\",X$16=\"\",X$17=\"\"),\"\",\nIF(X14=\"Primary\",\"- primary schools \",IF(X14=\"Secondary with sixth form\",\"- secondary schools with a sixth form \",IF(X14=\"Secondary without sixth form\",\"- secondary schools without a sixth form \",IF(X14=\"Special\",\"- special schools \",IF(X14=\"Alternative provision\",\"- alternative provision schools \",IF(X14=\"All-through\",\"- all-through schools \",IF(X14=\"Nursery\",\"- nursery schools \",\"\")))))))&Calcs!$I33&\" (for average teacher cost only)\")","v":""},{"$nulls":3},{"$f":"IF(OR(AB$14=\"\",AB$15=\"\",AB$16=\"\",AB$17=\"\"),\"\",\nIF(AB14=\"Primary\",\"- primary schools \",IF(AB14=\"Secondary with sixth form\",\"- secondary schools with a sixth form \",IF(AB14=\"Secondary without sixth form\",\"- secondary schools without a sixth form \",IF(AB14=\"Special\",\"- special schools \",IF(AB14=\"Alternative provision\",\"- alternative provision schools \",IF(AB14=\"All-through\",\"- all-through schools \",IF(AB14=\"Nursery\",\"- nursery schools \",\"\")))))))&Calcs!$I34&\" (for average teacher cost only)\")","v":""},{"$nulls":3},{"$f":"IF(OR(AF$14=\"\",AF$15=\"\",AF$16=\"\",AF$17=\"\"),\"\",\nIF(AF14=\"Primary\",\"- primary schools \",IF(AF14=\"Secondary with sixth form\",\"- secondary schools with a sixth form \",IF(AF14=\"Secondary without sixth form\",\"- secondary schools without a sixth form \",IF(AF14=\"Special\",\"- special schools \",IF(AF14=\"Alternative provision\",\"- alternative provision schools \",IF(AF14=\"All-through\",\"- all-through schools \",IF(AF14=\"Nursery\",\"- nursery schools \",\"\")))))))&Calcs!$I35&\" (for average teacher cost only)\")","v":""},{"$nulls":3},{"$f":"IF(OR(AJ$14=\"\",AJ$15=\"\",AJ$16=\"\",AJ$17=\"\"),\"\",\nIF(AJ14=\"Primary\",\"- primary schools \",IF(AJ14=\"Secondary with sixth form\",\"- secondary schools with a sixth form \",IF(AJ14=\"Secondary without sixth form\",\"- secondary schools without a sixth form \",IF(AJ14=\"Special\",\"- special schools \",IF(AJ14=\"Alternative provision\",\"- alternative provision schools \",IF(AJ14=\"All-through\",\"- all-through schools \",IF(AJ14=\"Nursery\",\"- nursery schools \",\"\")))))))&Calcs!$I36&\" (for average teacher cost only)\")","v":""},{"$nulls":3},{"$f":"IF(OR(AN$14=\"\",AN$15=\"\",AN$16=\"\",AN$17=\"\"),\"\",\nIF(AN14=\"Primary\",\"- primary schools \",IF(AN14=\"Secondary with sixth form\",\"- secondary schools with a sixth form \",IF(AN14=\"Secondary without sixth form\",\"- secondary schools without a sixth form \",IF(AN14=\"Special\",\"- special schools \",IF(AN14=\"Alternative provision\",\"- alternative provision schools \",IF(AN14=\"All-through\",\"- all-through schools \",IF(AN14=\"Nursery\",\"- nursery schools \",\"\")))))))&Calcs!$I37&\" (for average teacher cost only)\")","v":""},{"$nulls":3},{"$f":"IF(OR(AR$14=\"\",AR$15=\"\",AR$16=\"\",AR$17=\"\"),\"\",\nIF(AR14=\"Primary\",\"- primary schools \",IF(AR14=\"Secondary with sixth form\",\"- secondary schools with a sixth form \",IF(AR14=\"Secondary without sixth form\",\"- secondary schools without a sixth form \",IF(AR14=\"Special\",\"- special schools \",IF(AR14=\"Alternative provision\",\"- alternative provision schools \",IF(AR14=\"All-through\",\"- all-through schools \",IF(AR14=\"Nursery\",\"- nursery schools \",\"\")))))))&Calcs!$I38&\" (for average teacher cost only)\")","v":""},{"$nulls":3},{"$f":"IF(OR(AV$14=\"\",AV$15=\"\",AV$16=\"\",AV$17=\"\"),\"\",\nIF(AV14=\"Primary\",\"- primary schools \",IF(AV14=\"Secondary with sixth form\",\"- secondary schools with a sixth form \",IF(AV14=\"Secondary without sixth form\",\"- secondary schools without a sixth form \",IF(AV14=\"Special\",\"- special schools \",IF(AV14=\"Alternative provision\",\"- alternative provision schools \",IF(AV14=\"All-through\",\"- all-through schools \",IF(AV14=\"Nursery\",\"- nursery schools \",\"\")))))))&Calcs!$I39&\" (for average teacher cost only)\")","v":""},{"$nulls":3},{"$f":"IF(OR(AZ$14=\"\",AZ$15=\"\",AZ$16=\"\",AZ$17=\"\"),\"\",\nIF(AZ14=\"Primary\",\"- primary schools \",IF(AZ14=\"Secondary with sixth form\",\"- secondary schools with a sixth form \",IF(AZ14=\"Secondary without sixth form\",\"- secondary schools without a sixth form \",IF(AZ14=\"Special\",\"- special schools \",IF(AZ14=\"Alternative provision\",\"- alternative provision schools \",IF(AZ14=\"All-through\",\"- all-through schools \",IF(AZ14=\"Nursery\",\"- nursery schools \",\"\")))))))&Calcs!$I40&\" (for average teacher cost only)\")","v":""},{"$nulls":3},{"$f":"IF(OR(BD$14=\"\",BD$15=\"\",BD$16=\"\",BD$17=\"\"),\"\",\nIF(BD14=\"Primary\",\"- primary schools \",IF(BD14=\"Secondary with sixth form\",\"- secondary schools with a sixth form \",IF(BD14=\"Secondary without sixth form\",\"- secondary schools without a sixth form \",IF(BD14=\"Special\",\"- special schools \",IF(BD14=\"Alternative provision\",\"- alternative provision schools \",IF(BD14=\"All-through\",\"- all-through schools \",IF(BD14=\"Nursery\",\"- nursery schools \",\"\")))))))&Calcs!$I41&\" (for average teacher cost only)\")","v":""},{"$nulls":3},{"$f":"IF(OR(BH$14=\"\",BH$15=\"\",BH$16=\"\",BH$17=\"\"),\"\",\nIF(BH14=\"Primary\",\"- primary schools \",IF(BH14=\"Secondary with sixth form\",\"- secondary schools with a sixth form \",IF(BH14=\"Secondary without sixth form\",\"- secondary schools without a sixth form \",IF(BH14=\"Special\",\"- special schools \",IF(BH14=\"Alternative provision\",\"- alternative provision schools \",IF(BH14=\"All-through\",\"- all-through schools \",IF(BH14=\"Nursery\",\"- nursery schools \",\"\")))))))&Calcs!$I42&\" (for average teacher cost only)\")","v":""},{"$nulls":3},{"$f":"IF(OR(BL$14=\"\",BL$15=\"\",BL$16=\"\",BL$17=\"\"),\"\",\nIF(BL14=\"Primary\",\"- primary schools \",IF(BL14=\"Secondary with sixth form\",\"- secondary schools with a sixth form \",IF(BL14=\"Secondary without sixth form\",\"- secondary schools without a sixth form \",IF(BL14=\"Special\",\"- special schools \",IF(BL14=\"Alternative provision\",\"- alternative provision schools \",IF(BL14=\"All-through\",\"- all-through schools \",IF(BL14=\"Nursery\",\"- nursery schools \",\"\")))))))&Calcs!$I43&\" (for average teacher cost only)\")","v":""},{"$nulls":3},{"$f":"IF(OR(BP$14=\"\",BP$15=\"\",BP$16=\"\",BP$17=\"\"),\"\",\nIF(BP14=\"Primary\",\"- primary schools \",IF(BP14=\"Secondary with sixth form\",\"- secondary schools with a sixth form \",IF(BP14=\"Secondary without sixth form\",\"- secondary schools without a sixth form \",IF(BP14=\"Special\",\"- special schools \",IF(BP14=\"Alternative provision\",\"- alternative provision schools \",IF(BP14=\"All-through\",\"- all-through schools \",IF(BP14=\"Nursery\",\"- nursery schools \",\"\")))))))&Calcs!$I44&\" (for average teacher cost only)\")","v":""},{"$nulls":3},{"$f":"IF(OR(BT$14=\"\",BT$15=\"\",BT$16=\"\",BT$17=\"\"),\"\",\nIF(BT14=\"Primary\",\"- primary schools \",IF(BT14=\"Secondary with sixth form\",\"- secondary schools with a sixth form \",IF(BT14=\"Secondary without sixth form\",\"- secondary schools without a sixth form \",IF(BT14=\"Special\",\"- special schools \",IF(BT14=\"Alternative provision\",\"- alternative provision schools \",IF(BT14=\"All-through\",\"- all-through schools \",IF(BT14=\"Nursery\",\"- nursery schools \",\"\")))))))&Calcs!$I45&\" (for average teacher cost only)\")","v":""},{"$nulls":3},{"$f":"IF(OR(BX$14=\"\",BX$15=\"\",BX$16=\"\",BX$17=\"\"),\"\",\nIF(BX14=\"Primary\",\"- primary schools \",IF(BX14=\"Secondary with sixth form\",\"- secondary schools with a sixth form \",IF(BX14=\"Secondary without sixth form\",\"- secondary schools without a sixth form \",IF(BX14=\"Special\",\"- special schools \",IF(BX14=\"Alternative provision\",\"- alternative provision schools \",IF(BX14=\"All-through\",\"- all-through schools \",IF(BX14=\"Nursery\",\"- nursery schools \",\"\")))))))&Calcs!$I46&\" (for average teacher cost only)\")","v":""},{"$nulls":3},{"$f":"IF(OR(CB$14=\"\",CB$15=\"\",CB$16=\"\",CB$17=\"\"),\"\",\nIF(CB14=\"Primary\",\"- primary schools \",IF(CB14=\"Secondary with sixth form\",\"- secondary schools with a sixth form \",IF(CB14=\"Secondary without sixth form\",\"- secondary schools without a sixth form \",IF(CB14=\"Special\",\"- special schools \",IF(CB14=\"Alternative provision\",\"- alternative provision schools \",IF(CB14=\"All-through\",\"- all-through schools \",IF(CB14=\"Nursery\",\"- nursery schools \",\"\")))))))&Calcs!$I47&\" (for average teacher cost only)\")","v":""},{"$nulls":3},{"$f":"IF(OR(CF$14=\"\",CF$15=\"\",CF$16=\"\",CF$17=\"\"),\"\",\nIF(CF14=\"Primary\",\"- primary schools \",IF(CF14=\"Secondary with sixth form\",\"- secondary schools with a sixth form \",IF(CF14=\"Secondary without sixth form\",\"- secondary schools without a sixth form \",IF(CF14=\"Special\",\"- special schools \",IF(CF14=\"Alternative provision\",\"- alternative provision schools \",IF(CF14=\"All-through\",\"- all-through schools \",IF(CF14=\"Nursery\",\"- nursery schools \",\"\")))))))&Calcs!$I48&\" (for average teacher cost only)\")","v":""}]
[]
[]
[null,null,"Add up to 20 schools by using the Click here to add another school buttons. Macros must be enabled for this feature."]
[]
[{"$nulls":5},"Input the school's percentages and ratios directly below, or click here to input raw spending and characteristics data for this school",{"$nulls":3},"Input the school's percentages and ratios directly below, or click here to input raw spending and characteristics data for this school",{"$nulls":3},"Input the school's percentages and ratios directly below, or click here to input raw spending and characteristics data for this school",{"$nulls":3},"Input the school's percentages and ratios directly below, or click here to input raw spending and characteristics data for this school",{"$nulls":3},"Input the school's percentages and ratios directly below, or click here to input raw spending and characteristics data for this school",{"$nulls":3},"Input the school's percentages and ratios directly below, or click here to input raw spending and characteristics data for this school",{"$nulls":3},"Input the school's percentages and ratios directly below, or click here to input raw spending and characteristics data for this school",{"$nulls":3},"Input the school's percentages and ratios directly below, or click here to input raw spending and characteristics data for this school",{"$nulls":3},"Input the school's percentages and ratios directly below, or click here to input raw spending and characteristics data for this school",{"$nulls":3},"Input the school's percentages and ratios directly below, or click here to input raw spending and characteristics data for this school",{"$nulls":3},"Input the school's percentages and ratios directly below, or click here to input raw spending and characteristics data for this school",{"$nulls":3},"Input the school's percentages and ratios directly below, or click here to input raw spending and characteristics data for this school",{"$nulls":3},"Input the school's percentages and ratios directly below, or click here to input raw spending and characteristics data for this school",{"$nulls":3},"Input the school's percentages and ratios directly below, or click here to input raw spending and characteristics data for this school",{"$nulls":3},"Input the school's percentages and ratios directly below, or click here to input raw spending and characteristics data for this school",{"$nulls":3},"Input the school's percentages and ratios directly below, or click here to input raw spending and characteristics data for this school",{"$nulls":3},"Input the school's percentages and ratios directly below, or click here to input raw spending and characteristics data for this school",{"$nulls":3},"Input the school's percentages and ratios directly below, or click here to input raw spending and characteristics data for this school",{"$nulls":3},"Input the school's percentages and ratios directly below, or click here to input raw spending and characteristics data for this school",{"$nulls":3},"Input the school's percentages and ratios directly below, or click here to input raw spending and characteristics data for this school"]
[]
[null,null,"Using the results from the dashboard\n\nClick here for explanations of what the red, amber and green (RAG) ratings mean and what do\nwith the results."]
[]
[]
[]
[]
[{"$nulls":5},"The school's\ndata",null,"Rating against\nthresholds",null,"The school's\ndata",null,"Rating against\nthresholds",null,"The school's\ndata",null,"Rating against\nthresholds",null,"The school's\ndata",null,"Rating against\nthresholds",null,"The school's\ndata",null,"Rating against\nthresholds",null,"The school's\ndata",null,"Rating against\nthresholds",null,"The school's\ndata",null,"Rating against\nthresholds",null,"The school's\ndata",null,"Rating against\nthresholds",null,"The school's\ndata",null,"Rating against\nthresholds",null,"The school's\ndata",null,"Rating against\nthresholds",null,"The school's\ndata",null,"Rating against\nthresholds",null,"The school's\ndata",null,"Rating against\nthresholds",null,"The school's\ndata",null,"Rating against\nthresholds",null,"The school's\ndata",null,"Rating against\nthresholds",null,"The school's\ndata",null,"Rating against\nthresholds",null,"The school's\ndata",null,"Rating against\nthresholds",null,"The school's\ndata",null,"Rating against\nthresholds",null,"The school's\ndata",null,"Rating against\nthresholds",null,"The school's\ndata",null,"Rating against\nthresholds",null,"The school's\ndata",null,"Rating against\nthresholds"]
[]
[null,null,"B. Spending as a percentage of total expenditure"]
[]
[null,null,"Spend on teaching staff as a percentage of total expenditure","Guidance",null,{"$f":"IFERROR('Optional - input raw data'!F34/'Optional - input raw data'!F23,Calcs!$A$75)","v":{"v":0.5950848742571324,"d":"59.5%"}},null,{"$f":"IF(OR(H$14=\"\",H$15=\"\",H$16=\"\",H$17=\"\",F38=\"\"),\"\",\nIF(F38<=Calcs!C9,Lowest10,\nIF(AND(F38>Calcs!C9,F38<=Calcs!D9),Lowest20,\nIF(AND(F38>Calcs!D9,F38<=Calcs!E9),Inline,\nIF(AND(F38>Calcs!E9,F38<=Calcs!G9),Middle20,\nIF(AND(F38>Calcs!G9,F38<=Calcs!H9),Inline,\nIF(AND(F38>Calcs!H9,F38<=Calcs!I9),Highest20,\nIF(F38>Calcs!I9,Highest10,\"\"))))))))","v":"Broadly in line with similar schools"},null,{"$f":"IFERROR('Optional - input raw data'!H34/'Optional - input raw data'!H23,Calcs!$A$75)","v":""},null,{"$f":"IF(OR(L$14=\"\",L$15=\"\",L$16=\"\",L$17=\"\",J38=\"\"),\"\",\nIF(J38<=Calcs!K9,Lowest10,\nIF(AND(J38>Calcs!K9,J38<=Calcs!L9),Lowest20,\nIF(AND(J38>Calcs!L9,J38<=Calcs!M9),Inline,\nIF(AND(J38>Calcs!M9,J38<=Calcs!O9),Middle20,\nIF(AND(J38>Calcs!O9,J38<=Calcs!P9),Inline,\nIF(AND(J38>Calcs!P9,J38<=Calcs!Q9),Highest20,\nIF(J38>Calcs!Q9,Highest10,\"\"))))))))","v":""},null,{"$f":"IFERROR('Optional - input raw data'!J34/'Optional - input raw data'!J23,Calcs!$A$75)","v":""},null,{"$f":"IF(OR(P$14=\"\",P$15=\"\",P$16=\"\",P$17=\"\",N38=\"\"),\"\",\nIF(N38<=Calcs!S9,Lowest10,\nIF(AND(N38>Calcs!S9,N38<=Calcs!T9),Lowest20,\nIF(AND(N38>Calcs!T9,N38<=Calcs!U9),Inline,\nIF(AND(N38>Calcs!U9,N38<=Calcs!W9),Middle20,\nIF(AND(N38>Calcs!W9,N38<=Calcs!X9),Inline,\nIF(AND(N38>Calcs!X9,N38<=Calcs!Y9),Highest20,\nIF(N38>Calcs!Y9,Highest10,\"\"))))))))","v":""},null,{"$f":"IFERROR('Optional - input raw data'!L34/'Optional - input raw data'!L23,Calcs!$A$75)","v":""},null,{"$f":"IF(OR(T$14=\"\",T$15=\"\",T$16=\"\",T$17=\"\",R38=\"\"),\"\",\nIF(R38<=Calcs!AA9,Lowest10,\nIF(AND(R38>Calcs!AA9,R38<=Calcs!AB9),Lowest20,\nIF(AND(R38>Calcs!AB9,R38<=Calcs!AC9),Inline,\nIF(AND(R38>Calcs!AC9,R38<=Calcs!AE9),Middle20,\nIF(AND(R38>Calcs!AE9,R38<=Calcs!AF9),Inline,\nIF(AND(R38>Calcs!AF9,R38<=Calcs!AG9),Highest20,\nIF(R38>Calcs!AG9,Highest10,\"\"))))))))","v":""},null,{"$f":"IFERROR('Optional - input raw data'!N34/'Optional - input raw data'!N23,\"\")","v":""},null,{"$f":"IF(OR(X$14=\"\",X$15=\"\",X$16=\"\",X$17=\"\",V38=\"\"),\"\",\nIF(V38<=Calcs!AI9,Lowest10,\nIF(AND(V38>Calcs!AI9,V38<=Calcs!AJ9),Lowest20,\nIF(AND(V38>Calcs!AJ9,V38<=Calcs!AK9),Inline,\nIF(AND(V38>Calcs!AK9,V38<=Calcs!AM9),Middle20,\nIF(AND(V38>Calcs!AM9,V38<=Calcs!AN9),Inline,\nIF(AND(V38>Calcs!AN9,V38<=Calcs!AO9),Highest20,\nIF(V38>Calcs!AO9,Highest10,\"\"))))))))","v":""},null,{"$f":"IFERROR('Optional - input raw data'!V34/'Optional - input raw data'!V23,\"\")","v":""},null,{"$f":"IF(OR(AB$14=\"\",AB$15=\"\",AB$16=\"\",AB$17=\"\",Z38=\"\"),\"\",\nIF(Z38<=Calcs!AQ9,Lowest10,\nIF(AND(Z38>Calcs!AQ9,Z38<=Calcs!AR9),Lowest20,\nIF(AND(Z38>Calcs!AR9,Z38<=Calcs!AS9),Inline,\nIF(AND(Z38>Calcs!AS9,Z38<=Calcs!AU9),Middle20,\nIF(AND(Z38>Calcs!AU9,Z38<=Calcs!AV9),Inline,\nIF(AND(Z38>Calcs!AV9,Z38<=Calcs!AW9),Highest20,\nIF(Z38>Calcs!AW9,Highest10,\"\"))))))))","v":""},null,{"$f":"IFERROR('Optional - input raw data'!R34/'Optional - input raw data'!R23,\"\")","v":""},null,{"$f":"IF(OR(AF$14=\"\",AF$15=\"\",AF$16=\"\",AF$17=\"\",AD38=\"\"),\"\",\nIF(AD38<=Calcs!AY9,Lowest10,\nIF(AND(AD38>Calcs!AY9,AD38<=Calcs!AZ9),Lowest20,\nIF(AND(AD38>Calcs!AZ9,AD38<=Calcs!BA9),Inline,\nIF(AND(AD38>Calcs!BA9,AD38<=Calcs!BC9),Middle20,\nIF(AND(AD38>Calcs!BC9,AD38<=Calcs!BD9),Inline,\nIF(AND(AD38>Calcs!BD9,AD38<=Calcs!BE9),Highest20,\nIF(AD38>Calcs!BE9,Highest10,\"\"))))))))","v":""},null,{"$f":"IFERROR('Optional - input raw data'!T34/'Optional - input raw data'!T23,\"\")","v":""},null,{"$f":"IF(OR(AJ$14=\"\",AJ$15=\"\",AJ$16=\"\",AJ$17=\"\",AH38=\"\"),\"\",\nIF(AH38<=Calcs!BG9,Lowest10,\nIF(AND(AH38>Calcs!BG9,AH38<=Calcs!BH9),Lowest20,\nIF(AND(AH38>Calcs!BH9,AH38<=Calcs!BI9),Inline,\nIF(AND(AH38>Calcs!BI9,AH38<=Calcs!BK9),Middle20,\nIF(AND(AH38>Calcs!BK9,AH38<=Calcs!BL9),Inline,\nIF(AND(AH38>Calcs!BL9,AH38<=Calcs!BM9),Highest20,\nIF(AH38>Calcs!BM9,Highest10,\"\"))))))))","v":""},null,{"$f":"IFERROR('Optional - input raw data'!V34/'Optional - input raw data'!V23,\"\")","v":""},null,{"$f":"IF(OR(AN$14=\"\",AN$15=\"\",AN$16=\"\",AN$17=\"\",AL38=\"\"),\"\",\nIF(AL38<=Calcs!BO9,Lowest10,\nIF(AND(AL38>Calcs!BO9,AL38<=Calcs!BP9),Lowest20,\nIF(AND(AL38>Calcs!BP9,AL38<=Calcs!BQ9),Inline,\nIF(AND(AL38>Calcs!BQ9,AL38<=Calcs!BS9),Middle20,\nIF(AND(AL38>Calcs!BS9,AL38<=Calcs!BT9),Inline,\nIF(AND(AL38>Calcs!BT9,AL38<=Calcs!BU9),Highest20,\nIF(AL38>Calcs!BU9,Highest10,\"\"))))))))","v":""},null,{"$f":"IFERROR('Optional - input raw data'!X34/'Optional - input raw data'!X23,\"\")","v":""},null,{"$f":"IF(OR(AR$14=\"\",AR$15=\"\",AR$16=\"\",AR$17=\"\",AP38=\"\"),\"\",\nIF(AP38<=Calcs!BW9,Lowest10,\nIF(AND(AP38>Calcs!BW9,AP38<=Calcs!BX9),Lowest20,\nIF(AND(AP38>Calcs!BX9,AP38<=Calcs!BY9),Inline,\nIF(AND(AP38>Calcs!BY9,AP38<=Calcs!CA9),Middle20,\nIF(AND(AP38>Calcs!CA9,AP38<=Calcs!CB9),Inline,\nIF(AND(AP38>Calcs!CB9,AP38<=Calcs!CC9),Highest20,\nIF(AP38>Calcs!CC9,Highest10,\"\"))))))))","v":""},null,{"$f":"IFERROR('Optional - input raw data'!Z34/'Optional - input raw data'!Z23,\"\")","v":""},null,{"$f":"IF(OR(AV$14=\"\",AV$15=\"\",AV$16=\"\",AV$17=\"\",AT38=\"\"),\"\",\nIF(AT38<=Calcs!CE9,Lowest10,\nIF(AND(AT38>Calcs!CE9,AT38<=Calcs!CF9),Lowest20,\nIF(AND(AT38>Calcs!CF9,AT38<=Calcs!CG9),Inline,\nIF(AND(AT38>Calcs!CG9,AT38<=Calcs!CI9),Middle20,\nIF(AND(AT38>Calcs!CI9,AT38<=Calcs!CJ9),Inline,\nIF(AND(AT38>Calcs!CJ9,AT38<=Calcs!CK9),Highest20,\nIF(AT38>Calcs!CK9,Highest10,\"\"))))))))","v":""},null,{"$f":"IFERROR('Optional - input raw data'!AB34/'Optional - input raw data'!AB23,\"\")","v":""},null,{"$f":"IF(OR(AZ$14=\"\",AZ$15=\"\",AZ$16=\"\",AZ$17=\"\",AX38=\"\"),\"\",\nIF(AX38<=Calcs!CM9,Lowest10,\nIF(AND(AX38>Calcs!CM9,AX38<=Calcs!CN9),Lowest20,\nIF(AND(AX38>Calcs!CN9,AX38<=Calcs!CO9),Inline,\nIF(AND(AX38>Calcs!CO9,AX38<=Calcs!CQ9),Middle20,\nIF(AND(AX38>Calcs!CQ9,AX38<=Calcs!CR9),Inline,\nIF(AND(AX38>Calcs!CR9,AX38<=Calcs!CS9),Highest20,\nIF(AX38>Calcs!CS9,Highest10,\"\"))))))))","v":""},null,{"$f":"IFERROR('Optional - input raw data'!AD34/'Optional - input raw data'!AD23,\"\")","v":""},null,{"$f":"IF(OR(BD$14=\"\",BD$15=\"\",BD$16=\"\",BD$17=\"\",BB38=\"\"),\"\",\nIF(BB38<=Calcs!CU9,Lowest10,\nIF(AND(BB38>Calcs!CU9,BB38<=Calcs!CV9),Lowest20,\nIF(AND(BB38>Calcs!CV9,BB38<=Calcs!CW9),Inline,\nIF(AND(BB38>Calcs!CW9,BB38<=Calcs!CY9),Middle20,\nIF(AND(BB38>Calcs!CY9,BB38<=Calcs!CZ9),Inline,\nIF(AND(BB38>Calcs!CZ9,BB38<=Calcs!DA9),Highest20,\nIF(BB38>Calcs!DA9,Highest10,\"\"))))))))","v":""},null,{"$f":"IFERROR('Optional - input raw data'!AF34/'Optional - input raw data'!AF23,\"\")","v":""},null,{"$f":"IF(OR(BH$14=\"\",BH$15=\"\",BH$16=\"\",BH$17=\"\",BF38=\"\"),\"\",\nIF(BF38<=Calcs!DC9,Lowest10,\nIF(AND(BF38>Calcs!DC9,BF38<=Calcs!DD9),Lowest20,\nIF(AND(BF38>Calcs!DD9,BF38<=Calcs!DE9),Inline,\nIF(AND(BF38>Calcs!DE9,BF38<=Calcs!DG9),Middle20,\nIF(AND(BF38>Calcs!DG9,BF38<=Calcs!DH9),Inline,\nIF(AND(BF38>Calcs!DH9,BF38<=Calcs!DI9),Highest20,\nIF(BF38>Calcs!DI9,Highest10,\"\"))))))))","v":""},null,{"$f":"IFERROR('Optional - input raw data'!AH34/'Optional - input raw data'!AH23,\"\")","v":""},null,{"$f":"IF(OR(BL$14=\"\",BL$15=\"\",BL$16=\"\",BL$17=\"\",BJ38=\"\"),\"\",\nIF(BJ38<=Calcs!DK9,Lowest10,\nIF(AND(BJ38>Calcs!DK9,BJ38<=Calcs!DL9),Lowest20,\nIF(AND(BJ38>Calcs!DL9,BJ38<=Calcs!DM9),Inline,\nIF(AND(BJ38>Calcs!DM9,BJ38<=Calcs!DO9),Middle20,\nIF(AND(BJ38>Calcs!DO9,BJ38<=Calcs!DP9),Inline,\nIF(AND(BJ38>Calcs!DP9,BJ38<=Calcs!DQ9),Highest20,\nIF(BJ38>Calcs!DQ9,Highest10,\"\"))))))))","v":""},null,{"$f":"IFERROR('Optional - input raw data'!AJ34/'Optional - input raw data'!AJ23,\"\")","v":""},null,{"$f":"IF(OR(BP$14=\"\",BP$15=\"\",BP$16=\"\",BP$17=\"\",BN38=\"\"),\"\",\nIF(BN38<=Calcs!DS9,Lowest10,\nIF(AND(BN38>Calcs!DS9,BN38<=Calcs!DT9),Lowest20,\nIF(AND(BN38>Calcs!DT9,BN38<=Calcs!DU9),Inline,\nIF(AND(BN38>Calcs!DU9,BN38<=Calcs!DW9),Middle20,\nIF(AND(BN38>Calcs!DW9,BN38<=Calcs!DX9),Inline,\nIF(AND(BN38>Calcs!DX9,BN38<=Calcs!DY9),Highest20,\nIF(BN38>Calcs!DY9,Highest10,\"\"))))))))","v":""},null,{"$f":"IFERROR('Optional - input raw data'!AL34/'Optional - input raw data'!AL23,\"\")","v":""},null,{"$f":"IF(OR(BT$14=\"\",BT$15=\"\",BT$16=\"\",BT$17=\"\",BR38=\"\"),\"\",\nIF(BR38<=Calcs!EA9,Lowest10,\nIF(AND(BR38>Calcs!EA9,BR38<=Calcs!EB9),Lowest20,\nIF(AND(BR38>Calcs!EB9,BR38<=Calcs!EC9),Inline,\nIF(AND(BR38>Calcs!EC9,BR38<=Calcs!EE9),Middle20,\nIF(AND(BR38>Calcs!EE9,BR38<=Calcs!EF9),Inline,\nIF(AND(BR38>Calcs!EF9,BR38<=Calcs!EG9),Highest20,\nIF(BR38>Calcs!EG9,Highest10,\"\"))))))))","v":""},null,{"$f":"IFERROR('Optional - input raw data'!AN34/'Optional - input raw data'!AN23,\"\")","v":""},null,{"$f":"IF(OR(BX$14=\"\",BX$15=\"\",BX$16=\"\",BX$17=\"\",BV38=\"\"),\"\",\nIF(BV38<=Calcs!EI9,Lowest10,\nIF(AND(BV38>Calcs!EI9,BV38<=Calcs!EJ9),Lowest20,\nIF(AND(BV38>Calcs!EJ9,BV38<=Calcs!EK9),Inline,\nIF(AND(BV38>Calcs!EK9,BV38<=Calcs!EM9),Middle20,\nIF(AND(BV38>Calcs!EM9,BV38<=Calcs!EN9),Inline,\nIF(AND(BV38>Calcs!EN9,BV38<=Calcs!EO9),Highest20,\nIF(BV38>Calcs!EO9,Highest10,\"\"))))))))","v":""},null,{"$f":"IFERROR('Optional - input raw data'!AP34/'Optional - input raw data'!AP23,\"\")","v":""},null,{"$f":"IF(OR(CB$14=\"\",CB$15=\"\",CB$16=\"\",CB$17=\"\",BZ38=\"\"),\"\",\nIF(BZ38<=Calcs!EQ9,Lowest10,\nIF(AND(BZ38>Calcs!EQ9,BZ38<=Calcs!ER9),Lowest20,\nIF(AND(BZ38>Calcs!ER9,BZ38<=Calcs!ES9),Inline,\nIF(AND(BZ38>Calcs!ES9,BZ38<=Calcs!EU9),Middle20,\nIF(AND(BZ38>Calcs!EU9,BZ38<=Calcs!EV9),Inline,\nIF(AND(BZ38>Calcs!EV9,BZ38<=Calcs!EW9),Highest20,\nIF(BZ38>Calcs!EW9,Highest10,\"\"))))))))","v":""},null,{"$f":"IFERROR('Optional - input raw data'!AR34/'Optional - input raw data'!AR23,Calcs!$A$75)","v":""},null,{"$f":"IF(OR(CF$14=\"\",CF$15=\"\",CF$16=\"\",CF$17=\"\",CD38=\"\"),\"\",\nIF(CD38<=Calcs!EY9,Lowest10,\nIF(AND(CD38>Calcs!EY9,CD38<=Calcs!EZ9),Lowest20,\nIF(AND(CD38>Calcs!EZ9,CD38<=Calcs!FA9),Inline,\nIF(AND(CD38>Calcs!FA9,CD38<=Calcs!FC9),Middle20,\nIF(AND(CD38>Calcs!FC9,CD38<=Calcs!FD9),Inline,\nIF(AND(CD38>Calcs!FD9,CD38<=Calcs!FE9),Highest20,\nIF(CD38>Calcs!FE9,Highest10,\"\"))))))))","v":""}]
[null,null,"Spend on supply staff as a percentage of total expenditure","Guidance",null,{"$f":"IFERROR(('Optional - input raw data'!F35+'Optional - input raw data'!F43+'Optional - input raw data'!F57)/'Optional - input raw data'!F23,Calcs!$A$75)","v":{"v":2.7231216995765003E-3,"d":"0.3%"}},null,{"$f":"IF(OR(H$14=\"\",H$15=\"\",H$16=\"\",H$17=\"\",F39=\"\"),\"\",\nIF(F39<=Calcs!E10,Inline,\nIF(AND(F39>Calcs!E10,F39<=Calcs!G10),Middle20,\nIF(AND(F39>Calcs!G10,F39<=Calcs!H10),Inline,\nIF(AND(F39>Calcs!H10,F39<=Calcs!I10),Highest20,\nIF(F39>Calcs!I10,Highest10,\"\"))))))","v":"Broadly in line with similar schools"},null,{"$f":"IFERROR(('Optional - input raw data'!H35+'Optional - input raw data'!H43+'Optional - input raw data'!H57)/'Optional - input raw data'!H23,Calcs!$A$75)","v":""},null,{"$f":"IF(OR(L$14=\"\",L$15=\"\",L$16=\"\",L$17=\"\",J39=\"\"),\"\",\nIF(J39<=Calcs!M10,Inline,\nIF(AND(J39>Calcs!M10,J39<=Calcs!O10),Middle20,\nIF(AND(J39>Calcs!O10,J39<=Calcs!P10),Inline,\nIF(AND(J39>Calcs!P10,J39<=Calcs!Q10),Highest20,\nIF(J39>Calcs!Q10,Highest10,\"\"))))))","v":""},null,{"$f":"IFERROR(('Optional - input raw data'!J35+'Optional - input raw data'!J43+'Optional - input raw data'!J57)/'Optional - input raw data'!J23,Calcs!$A$75)","v":""},null,{"$f":"IF(OR(P$14=\"\",P$15=\"\",P$16=\"\",P$17=\"\",N39=\"\"),\"\",\nIF(N39<=Calcs!U10,Inline,\nIF(AND(N39>Calcs!U10,N39<=Calcs!W10),Middle20,\nIF(AND(N39>Calcs!W10,N39<=Calcs!X10),Inline,\nIF(AND(N39>Calcs!X10,N39<=Calcs!Y10),Highest20,\nIF(N39>Calcs!Y10,Highest10,\"\"))))))","v":""},null,{"$f":"IFERROR(('Optional - input raw data'!L35+'Optional - input raw data'!L43+'Optional - input raw data'!L57)/'Optional - input raw data'!L23,Calcs!$A$75)","v":""},null,{"$f":"IF(OR(T$14=\"\",T$15=\"\",T$16=\"\",T$17=\"\",R39=\"\"),\"\",\nIF(R39<=Calcs!AC10,Inline,\nIF(AND(R39>Calcs!AC10,R39<=Calcs!AE10),Middle20,\nIF(AND(R39>Calcs!AE10,R39<=Calcs!AF10),Inline,\nIF(AND(R39>Calcs!AF10,R39<=Calcs!AG10),Highest20,\nIF(R39>Calcs!AG10,Highest10,\"\"))))))","v":""},null,{"$f":"IFERROR(('Optional - input raw data'!N35+'Optional - input raw data'!N43+'Optional - input raw data'!N57)/'Optional - input raw data'!N23,\"\")","v":""},null,{"$f":"IF(OR(X$14=\"\",X$15=\"\",X$16=\"\",X$17=\"\",V39=\"\"),\"\",\nIF(V39<=Calcs!AK10,Inline,\nIF(AND(V39>Calcs!AK10,V39<=Calcs!AM10),Middle20,\nIF(AND(V39>Calcs!AM10,V39<=Calcs!AN10),Inline,\nIF(AND(V39>Calcs!AN10,V39<=Calcs!AO10),Highest20,\nIF(V39>Calcs!AO10,Highest10,\"\"))))))","v":""},null,{"$f":"IFERROR(('Optional - input raw data'!P35+'Optional - input raw data'!P43+'Optional - input raw data'!P57)/'Optional - input raw data'!P23,\"\")","v":""},null,{"$f":"IF(OR(AB$14=\"\",AB$15=\"\",AB$16=\"\",AB$17=\"\",Z39=\"\"),\"\",\nIF(Z39<=Calcs!AS10,Inline,\nIF(AND(Z39>Calcs!AS10,Z39<=Calcs!AU10),Middle20,\nIF(AND(Z39>Calcs!AU10,Z39<=Calcs!AV10),Inline,\nIF(AND(Z39>Calcs!AV10,Z39<=Calcs!AW10),Highest20,\nIF(Z39>Calcs!AW10,Highest10,\"\"))))))","v":""},null,{"$f":"IFERROR(('Optional - input raw data'!R35+'Optional - input raw data'!R43+'Optional - input raw data'!R57)/'Optional - input raw data'!R23,\"\")","v":""},null,{"$f":"IF(OR(AF$14=\"\",AF$15=\"\",AF$16=\"\",AF$17=\"\",AD39=\"\"),\"\",\nIF(AD39<=Calcs!BA10,Inline,\nIF(AND(AD39>Calcs!BA10,AD39<=Calcs!BC10),Middle20,\nIF(AND(AD39>Calcs!BC10,AD39<=Calcs!BD10),Inline,\nIF(AND(AD39>Calcs!BD10,AD39<=Calcs!BE10),Highest20,\nIF(AD39>Calcs!BE10,Highest10,\"\"))))))","v":""},null,{"$f":"IFERROR(('Optional - input raw data'!T35+'Optional - input raw data'!T43+'Optional - input raw data'!T57)/'Optional - input raw data'!T23,\"\")","v":""},null,{"$f":"IF(OR(AJ$14=\"\",AJ$15=\"\",AJ$16=\"\",AJ$17=\"\",AH39=\"\"),\"\",\nIF(AH39<=Calcs!BI10,Inline,\nIF(AND(AH39>Calcs!BI10,AH39<=Calcs!BK10),Middle20,\nIF(AND(AH39>Calcs!BK10,AH39<=Calcs!BL10),Inline,\nIF(AND(AH39>Calcs!BL10,AH39<=Calcs!BM10),Highest20,\nIF(AH39>Calcs!BM10,Highest10,\"\"))))))","v":""},null,{"$f":"IFERROR(('Optional - input raw data'!V35+'Optional - input raw data'!V43+'Optional - input raw data'!V57)/'Optional - input raw data'!V23,\"\")","v":""},null,{"$f":"IF(OR(AN$14=\"\",AN$15=\"\",AN$16=\"\",AN$17=\"\",AL39=\"\"),\"\",\nIF(AL39<=Calcs!BQ10,Inline,\nIF(AND(AL39>Calcs!BQ10,AL39<=Calcs!BS10),Middle20,\nIF(AND(AL39>Calcs!BS10,AL39<=Calcs!BT10),Inline,\nIF(AND(AL39>Calcs!BT10,AL39<=Calcs!BU10),Highest20,\nIF(AL39>Calcs!BU10,Highest10,\"\"))))))","v":""},null,{"$f":"IFERROR(('Optional - input raw data'!X35+'Optional - input raw data'!X43+'Optional - input raw data'!X57)/'Optional - input raw data'!X23,\"\")","v":""},null,{"$f":"IF(OR(AR$14=\"\",AR$15=\"\",AR$16=\"\",AR$17=\"\",AP39=\"\"),\"\",\nIF(AP39<=Calcs!BY10,Inline,\nIF(AND(AP39>Calcs!BY10,AP39<=Calcs!CA10),Middle20,\nIF(AND(AP39>Calcs!CA10,AP39<=Calcs!CB10),Inline,\nIF(AND(AP39>Calcs!CB10,AP39<=Calcs!CC10),Highest20,\nIF(AP39>Calcs!CC10,Highest10,\"\"))))))","v":""},null,{"$f":"IFERROR(('Optional - input raw data'!Z35+'Optional - input raw data'!Z43+'Optional - input raw data'!Z57)/'Optional - input raw data'!Z23,\"\")","v":""},null,{"$f":"IF(OR(AV$14=\"\",AV$15=\"\",AV$16=\"\",AV$17=\"\",AT39=\"\"),\"\",\nIF(AT39<=Calcs!CG10,Inline,\nIF(AND(AT39>Calcs!CG10,AT39<=Calcs!CI10),Middle20,\nIF(AND(AT39>Calcs!CI10,AT39<=Calcs!CJ10),Inline,\nIF(AND(AT39>Calcs!CJ10,AT39<=Calcs!CK10),Highest20,\nIF(AT39>Calcs!CK10,Highest10,\"\"))))))","v":""},null,{"$f":"IFERROR(('Optional - input raw data'!AB35+'Optional - input raw data'!AB43+'Optional - input raw data'!AB57)/'Optional - input raw data'!AB23,\"\")","v":""},null,{"$f":"IF(OR(AZ$14=\"\",AZ$15=\"\",AZ$16=\"\",AZ$17=\"\",AX39=\"\"),\"\",\nIF(AX39<=Calcs!CO10,Inline,\nIF(AND(AX39>Calcs!CO10,AX39<=Calcs!CQ10),Middle20,\nIF(AND(AX39>Calcs!CQ10,AX39<=Calcs!CR10),Inline,\nIF(AND(AX39>Calcs!CR10,AX39<=Calcs!CS10),Highest20,\nIF(AX39>Calcs!CS10,Highest10,\"\"))))))","v":""},null,{"$f":"IFERROR(('Optional - input raw data'!AD35+'Optional - input raw data'!AD43+'Optional - input raw data'!AD57)/'Optional - input raw data'!AD23,\"\")","v":""},null,{"$f":"IF(OR(BD$14=\"\",BD$15=\"\",BD$16=\"\",BD$17=\"\",BB39=\"\"),\"\",\nIF(BB39<=Calcs!CW10,Inline,\nIF(AND(BB39>Calcs!CW10,BB39<=Calcs!CY10),Middle20,\nIF(AND(BB39>Calcs!CY10,BB39<=Calcs!CZ10),Inline,\nIF(AND(BB39>Calcs!CZ10,BB39<=Calcs!DA10),Highest20,\nIF(BB39>Calcs!DA10,Highest10,\"\"))))))","v":""},null,{"$f":"IFERROR(('Optional - input raw data'!AF35+'Optional - input raw data'!AF43+'Optional - input raw data'!AF57)/'Optional - input raw data'!AF23,\"\")","v":""},null,{"$f":"IF(OR(BH$14=\"\",BH$15=\"\",BH$16=\"\",BH$17=\"\",BF39=\"\"),\"\",\nIF(BF39<=Calcs!DE10,Inline,\nIF(AND(BF39>Calcs!DE10,BF39<=Calcs!DG10),Middle20,\nIF(AND(BF39>Calcs!DG10,BF39<=Calcs!DH10),Inline,\nIF(AND(BF39>Calcs!DH10,BF39<=Calcs!DI10),Highest20,\nIF(BF39>Calcs!DI10,Highest10,\"\"))))))","v":""},null,{"$f":"IFERROR(('Optional - input raw data'!AH35+'Optional - input raw data'!AH43+'Optional - input raw data'!AH57)/'Optional - input raw data'!AH23,\"\")","v":""},null,{"$f":"IF(OR(BL$14=\"\",BL$15=\"\",BL$16=\"\",BL$17=\"\",BJ39=\"\"),\"\",\nIF(BJ39<=Calcs!DM10,Inline,\nIF(AND(BJ39>Calcs!DM10,BJ39<=Calcs!DO10),Middle20,\nIF(AND(BJ39>Calcs!DO10,BJ39<=Calcs!DP10),Inline,\nIF(AND(BJ39>Calcs!DP10,BJ39<=Calcs!DQ10),Highest20,\nIF(BJ39>Calcs!DQ10,Highest10,\"\"))))))","v":""},null,{"$f":"IFERROR(('Optional - input raw data'!AJ35+'Optional - input raw data'!AJ43+'Optional - input raw data'!AJ57)/'Optional - input raw data'!AJ23,\"\")","v":""},null,{"$f":"IF(OR(BP$14=\"\",BP$15=\"\",BP$16=\"\",BP$17=\"\",BN39=\"\"),\"\",\nIF(BN39<=Calcs!DU10,Inline,\nIF(AND(BN39>Calcs!DU10,BN39<=Calcs!DW10),Middle20,\nIF(AND(BN39>Calcs!DW10,BN39<=Calcs!DX10),Inline,\nIF(AND(BN39>Calcs!DX10,BN39<=Calcs!DY10),Highest20,\nIF(BN39>Calcs!DY10,Highest10,\"\"))))))","v":""},null,{"$f":"IFERROR(('Optional - input raw data'!AL35+'Optional - input raw data'!AL43+'Optional - input raw data'!AL57)/'Optional - input raw data'!AL23,\"\")","v":""},null,{"$f":"IF(OR(BT$14=\"\",BT$15=\"\",BT$16=\"\",BT$17=\"\",BR39=\"\"),\"\",\nIF(BR39<=Calcs!EC10,Inline,\nIF(AND(BR39>Calcs!EC10,BR39<=Calcs!EE10),Middle20,\nIF(AND(BR39>Calcs!EE10,BR39<=Calcs!EF10),Inline,\nIF(AND(BR39>Calcs!EF10,BR39<=Calcs!EG10),Highest20,\nIF(BR39>Calcs!EG10,Highest10,\"\"))))))","v":""},null,{"$f":"IFERROR(('Optional - input raw data'!AN35+'Optional - input raw data'!AN43+'Optional - input raw data'!AN57)/'Optional - input raw data'!AN23,\"\")","v":""},null,{"$f":"IF(OR(BX$14=\"\",BX$15=\"\",BX$16=\"\",BX$17=\"\",BV39=\"\"),\"\",\nIF(BV39<=Calcs!EK10,Inline,\nIF(AND(BV39>Calcs!EK10,BV39<=Calcs!EM10),Middle20,\nIF(AND(BV39>Calcs!EM10,BV39<=Calcs!EN10),Inline,\nIF(AND(BV39>Calcs!EN10,BV39<=Calcs!EO10),Highest20,\nIF(BV39>Calcs!EO10,Highest10,\"\"))))))","v":""},null,{"$f":"IFERROR(('Optional - input raw data'!AP35+'Optional - input raw data'!AP43+'Optional - input raw data'!AP57)/'Optional - input raw data'!AP23,\"\")","v":""},null,{"$f":"IF(OR(CB$14=\"\",CB$15=\"\",CB$16=\"\",CB$17=\"\",BZ39=\"\"),\"\",\nIF(BZ39<=Calcs!ES10,Inline,\nIF(AND(BZ39>Calcs!ES10,BZ39<=Calcs!EU10),Middle20,\nIF(AND(BZ39>Calcs!EU10,BZ39<=Calcs!EV10),Inline,\nIF(AND(BZ39>Calcs!EV10,BZ39<=Calcs!EW10),Highest20,\nIF(BZ39>Calcs!EW10,Highest10,\"\"))))))","v":""},null,{"$f":"IFERROR(('Optional - input raw data'!AR35+'Optional - input raw data'!AR43+'Optional - input raw data'!AR57)/'Optional - input raw data'!AR23,Calcs!$A$75)","v":""},null,{"$f":"IF(OR(CF$14=\"\",CF$15=\"\",CF$16=\"\",CF$17=\"\",CD39=\"\"),\"\",\nIF(CD39<=Calcs!FA10,Inline,\nIF(AND(CD39>Calcs!FA10,CD39<=Calcs!FC10),Middle20,\nIF(AND(CD39>Calcs!FC10,CD39<=Calcs!FD10),Inline,\nIF(AND(CD39>Calcs!FD10,CD39<=Calcs!FE10),Highest20,\nIF(CD39>Calcs!FE10,Highest10,\"\"))))))","v":""}]
[null,null,"Spend on education support staff as a percentage of total expenditure","Guidance",null,{"$f":"IFERROR('Optional - input raw data'!F36/'Optional - input raw data'!F23,Calcs!$A$75)","v":{"v":0.07468488035692501,"d":"7.5%"}},null,{"$f":"IF(OR(H$14=\"\",H$15=\"\",H$16=\"\",H$17=\"\",F40=\"\"),\"\",\nIF(F40<=Calcs!E11,Inline,\nIF(AND(F40>Calcs!E11,F40<=Calcs!G11),Middle20,\nIF(AND(F40>Calcs!G11,F40<=Calcs!H11),Inline,\nIF(AND(F40>Calcs!H11,F40<=Calcs!I11),Highest20,\nIF(F40>Calcs!I11,Highest10,\"\"))))))","v":"Broadly in line with similar schools"},null,{"$f":"IFERROR('Optional - input raw data'!H36/'Optional - input raw data'!H23,Calcs!$A$75)","v":""},null,{"$f":"IF(OR(L$14=\"\",L$15=\"\",L$16=\"\",L$17=\"\",J40=\"\"),\"\",\nIF(J40<=Calcs!M11,Inline,\nIF(AND(J40>Calcs!M11,J40<=Calcs!O11),Middle20,\nIF(AND(J40>Calcs!O11,J40<=Calcs!P11),Inline,\nIF(AND(J40>Calcs!P11,J40<=Calcs!Q11),Highest20,\nIF(J40>Calcs!Q11,Highest10,\"\"))))))","v":""},null,{"$f":"IFERROR('Optional - input raw data'!J36/'Optional - input raw data'!J23,Calcs!$A$75)","v":""},null,{"$f":"IF(OR(P$14=\"\",P$15=\"\",P$16=\"\",P$17=\"\",N40=\"\"),\"\",\nIF(N40<=Calcs!U11,Inline,\nIF(AND(N40>Calcs!U11,N40<=Calcs!W11),Middle20,\nIF(AND(N40>Calcs!W11,N40<=Calcs!X11),Inline,\nIF(AND(N40>Calcs!X11,N40<=Calcs!Y11),Highest20,\nIF(N40>Calcs!Y11,Highest10,\"\"))))))","v":""},null,{"$f":"IFERROR('Optional - input raw data'!L36/'Optional - input raw data'!L23,Calcs!$A$75)","v":""},null,{"$f":"IF(OR(T$14=\"\",T$15=\"\",T$16=\"\",T$17=\"\",R40=\"\"),\"\",\nIF(R40<=Calcs!AC11,Inline,\nIF(AND(R40>Calcs!AC11,R40<=Calcs!AE11),Middle20,\nIF(AND(R40>Calcs!AE11,R40<=Calcs!AF11),Inline,\nIF(AND(R40>Calcs!AF11,R40<=Calcs!AG11),Highest20,\nIF(R40>Calcs!AG11,Highest10,\"\"))))))","v":""},null,{"$f":"IFERROR('Optional - input raw data'!N36/'Optional - input raw data'!N23,\"\")","v":""},null,{"$f":"IF(OR(X$14=\"\",X$15=\"\",X$16=\"\",X$17=\"\",V40=\"\"),\"\",\nIF(V40<=Calcs!AK11,Inline,\nIF(AND(V40>Calcs!AK11,V40<=Calcs!AM11),Middle20,\nIF(AND(V40>Calcs!AM11,V40<=Calcs!AN11),Inline,\nIF(AND(V40>Calcs!AN11,V40<=Calcs!AO11),Highest20,\nIF(V40>Calcs!AO11,Highest10,\"\"))))))","v":""},null,{"$f":"IFERROR('Optional - input raw data'!P36/'Optional - input raw data'!P23,\"\")","v":""},null,{"$f":"IF(OR(AB$14=\"\",AB$15=\"\",AB$16=\"\",AB$17=\"\",Z40=\"\"),\"\",\nIF(Z40<=Calcs!AS11,Inline,\nIF(AND(Z40>Calcs!AS11,Z40<=Calcs!AU11),Middle20,\nIF(AND(Z40>Calcs!AU11,Z40<=Calcs!AV11),Inline,\nIF(AND(Z40>Calcs!AV11,Z40<=Calcs!AW11),Highest20,\nIF(Z40>Calcs!AW11,Highest10,\"\"))))))","v":""},null,{"$f":"IFERROR('Optional - input raw data'!R36/'Optional - input raw data'!R23,\"\")","v":""},null,{"$f":"IF(OR(AF$14=\"\",AF$15=\"\",AF$16=\"\",AF$17=\"\",AD40=\"\"),\"\",\nIF(AD40<=Calcs!BA11,Inline,\nIF(AND(AD40>Calcs!BA11,AD40<=Calcs!BC11),Middle20,\nIF(AND(AD40>Calcs!BC11,AD40<=Calcs!BD11),Inline,\nIF(AND(AD40>Calcs!BD11,AD40<=Calcs!BE11),Highest20,\nIF(AD40>Calcs!BE11,Highest10,\"\"))))))","v":""},null,{"$f":"IFERROR('Optional - input raw data'!T36/'Optional - input raw data'!T23,\"\")","v":""},null,{"$f":"IF(OR(AJ$14=\"\",AJ$15=\"\",AJ$16=\"\",AJ$17=\"\",AH40=\"\"),\"\",\nIF(AH40<=Calcs!BI11,Inline,\nIF(AND(AH40>Calcs!BI11,AH40<=Calcs!BK11),Middle20,\nIF(AND(AH40>Calcs!BK11,AH40<=Calcs!BL11),Inline,\nIF(AND(AH40>Calcs!BL11,AH40<=Calcs!BM11),Highest20,\nIF(AH40>Calcs!BM11,Highest10,\"\"))))))","v":""},null,{"$f":"IFERROR('Optional - input raw data'!V36/'Optional - input raw data'!V23,\"\")","v":""},null,{"$f":"IF(OR(AN$14=\"\",AN$15=\"\",AN$16=\"\",AN$17=\"\",AL40=\"\"),\"\",\nIF(AL40<=Calcs!BQ11,Inline,\nIF(AND(AL40>Calcs!BQ11,AL40<=Calcs!BS11),Middle20,\nIF(AND(AL40>Calcs!BS11,AL40<=Calcs!BT11),Inline,\nIF(AND(AL40>Calcs!BT11,AL40<=Calcs!BU11),Highest20,\nIF(AL40>Calcs!BU11,Highest10,\"\"))))))","v":""},null,{"$f":"IFERROR('Optional - input raw data'!X36/'Optional - input raw data'!X23,\"\")","v":""},null,{"$f":"IF(OR(AR$14=\"\",AR$15=\"\",AR$16=\"\",AR$17=\"\",AP40=\"\"),\"\",\nIF(AP40<=Calcs!BY11,Inline,\nIF(AND(AP40>Calcs!BY11,AP40<=Calcs!CA11),Middle20,\nIF(AND(AP40>Calcs!CA11,AP40<=Calcs!CB11),Inline,\nIF(AND(AP40>Calcs!CB11,AP40<=Calcs!CC11),Highest20,\nIF(AP40>Calcs!CC11,Highest10,\"\"))))))","v":""},null,{"$f":"IFERROR('Optional - input raw data'!Z36/'Optional - input raw data'!Z23,\"\")","v":""},null,{"$f":"IF(OR(AV$14=\"\",AV$15=\"\",AV$16=\"\",AV$17=\"\",AT40=\"\"),\"\",\nIF(AT40<=Calcs!CG11,Inline,\nIF(AND(AT40>Calcs!CG11,AT40<=Calcs!CI11),Middle20,\nIF(AND(AT40>Calcs!CI11,AT40<=Calcs!CJ11),Inline,\nIF(AND(AT40>Calcs!CJ11,AT40<=Calcs!CK11),Highest20,\nIF(AT40>Calcs!CK11,Highest10,\"\"))))))","v":""},null,{"$f":"IFERROR('Optional - input raw data'!AB36/'Optional - input raw data'!AB23,\"\")","v":""},null,{"$f":"IF(OR(AZ$14=\"\",AZ$15=\"\",AZ$16=\"\",AZ$17=\"\",AX40=\"\"),\"\",\nIF(AX40<=Calcs!CO11,Inline,\nIF(AND(AX40>Calcs!CO11,AX40<=Calcs!CQ11),Middle20,\nIF(AND(AX40>Calcs!CQ11,AX40<=Calcs!CR11),Inline,\nIF(AND(AX40>Calcs!CR11,AX40<=Calcs!CS11),Highest20,\nIF(AX40>Calcs!CS11,Highest10,\"\"))))))","v":""},null,{"$f":"IFERROR('Optional - input raw data'!AD36/'Optional - input raw data'!AD23,\"\")","v":""},null,{"$f":"IF(OR(BD$14=\"\",BD$15=\"\",BD$16=\"\",BD$17=\"\",BB40=\"\"),\"\",\nIF(BB40<=Calcs!CW11,Inline,\nIF(AND(BB40>Calcs!CW11,BB40<=Calcs!CY11),Middle20,\nIF(AND(BB40>Calcs!CY11,BB40<=Calcs!CZ11),Inline,\nIF(AND(BB40>Calcs!CZ11,BB40<=Calcs!DA11),Highest20,\nIF(BB40>Calcs!DA11,Highest10,\"\"))))))","v":""},null,{"$f":"IFERROR('Optional - input raw data'!AF36/'Optional - input raw data'!AF23,\"\")","v":""},null,{"$f":"IF(OR(BH$14=\"\",BH$15=\"\",BH$16=\"\",BH$17=\"\",BF40=\"\"),\"\",\nIF(BF40<=Calcs!DE11,Inline,\nIF(AND(BF40>Calcs!DE11,BF40<=Calcs!DG11),Middle20,\nIF(AND(BF40>Calcs!DG11,BF40<=Calcs!DH11),Inline,\nIF(AND(BF40>Calcs!DH11,BF40<=Calcs!DI11),Highest20,\nIF(BF40>Calcs!DI11,Highest10,\"\"))))))","v":""},null,{"$f":"IFERROR('Optional - input raw data'!AH36/'Optional - input raw data'!AH23,\"\")","v":""},null,{"$f":"IF(OR(BL$14=\"\",BL$15=\"\",BL$16=\"\",BL$17=\"\",BJ40=\"\"),\"\",\nIF(BJ40<=Calcs!DM11,Inline,\nIF(AND(BJ40>Calcs!DM11,BJ40<=Calcs!DO11),Middle20,\nIF(AND(BJ40>Calcs!DO11,BJ40<=Calcs!DP11),Inline,\nIF(AND(BJ40>Calcs!DP11,BJ40<=Calcs!DQ11),Highest20,\nIF(BJ40>Calcs!DQ11,Highest10,\"\"))))))","v":""},null,{"$f":"IFERROR('Optional - input raw data'!AJ36/'Optional - input raw data'!AJ23,\"\")","v":""},null,{"$f":"IF(OR(BP$14=\"\",BP$15=\"\",BP$16=\"\",BP$17=\"\",BN40=\"\"),\"\",\nIF(BN40<=Calcs!DU11,Inline,\nIF(AND(BN40>Calcs!DU11,BN40<=Calcs!DW11),Middle20,\nIF(AND(BN40>Calcs!DW11,BN40<=Calcs!DX11),Inline,\nIF(AND(BN40>Calcs!DX11,BN40<=Calcs!DY11),Highest20,\nIF(BN40>Calcs!DY11,Highest10,\"\"))))))","v":""},null,{"$f":"IFERROR('Optional - input raw data'!AL36/'Optional - input raw data'!AL23,\"\")","v":""},null,{"$f":"IF(OR(BT$14=\"\",BT$15=\"\",BT$16=\"\",BT$17=\"\",BR40=\"\"),\"\",\nIF(BR40<=Calcs!EC11,Inline,\nIF(AND(BR40>Calcs!EC11,BR40<=Calcs!EE11),Middle20,\nIF(AND(BR40>Calcs!EE11,BR40<=Calcs!EF11),Inline,\nIF(AND(BR40>Calcs!EF11,BR40<=Calcs!EG11),Highest20,\nIF(BR40>Calcs!EG11,Highest10,\"\"))))))","v":""},null,{"$f":"IFERROR('Optional - input raw data'!AN36/'Optional - input raw data'!AN23,\"\")","v":""},null,{"$f":"IF(OR(BX$14=\"\",BX$15=\"\",BX$16=\"\",BX$17=\"\",BV40=\"\"),\"\",\nIF(BV40<=Calcs!EK11,Inline,\nIF(AND(BV40>Calcs!EK11,BV40<=Calcs!EM11),Middle20,\nIF(AND(BV40>Calcs!EM11,BV40<=Calcs!EN11),Inline,\nIF(AND(BV40>Calcs!EN11,BV40<=Calcs!EO11),Highest20,\nIF(BV40>Calcs!EO11,Highest10,\"\"))))))","v":""},null,{"$f":"IFERROR('Optional - input raw data'!AP36/'Optional - input raw data'!AP23,\"\")","v":""},null,{"$f":"IF(OR(CB$14=\"\",CB$15=\"\",CB$16=\"\",CB$17=\"\",BZ40=\"\"),\"\",\nIF(BZ40<=Calcs!ES11,Inline,\nIF(AND(BZ40>Calcs!ES11,BZ40<=Calcs!EU11),Middle20,\nIF(AND(BZ40>Calcs!EU11,BZ40<=Calcs!EV11),Inline,\nIF(AND(BZ40>Calcs!EV11,BZ40<=Calcs!EW11),Highest20,\nIF(BZ40>Calcs!EW11,Highest10,\"\"))))))","v":""},null,{"$f":"IFERROR('Optional - input raw data'!AR36/'Optional - input raw data'!AR23,Calcs!$A$75)","v":""},null,{"$f":"IF(OR(CF$14=\"\",CF$15=\"\",CF$16=\"\",CF$17=\"\",CD40=\"\"),\"\",\nIF(CD40<=Calcs!FA11,Inline,\nIF(AND(CD40>Calcs!FA11,CD40<=Calcs!FC11),Middle20,\nIF(AND(CD40>Calcs!FC11,CD40<=Calcs!FD11),Inline,\nIF(AND(CD40>Calcs!FD11,CD40<=Calcs!FE11),Highest20,\nIF(CD40>Calcs!FE11,Highest10,\"\"))))))","v":""}]
[null,null,"Spend on administrative and clerical staff as a percentage of total expenditure","Guidance",null,{"$f":"IFERROR('Optional - input raw data'!F37/'Optional - input raw data'!F23,Calcs!$A$75)","v":{"v":0.09926813381202182,"d":"9.9%"}},null,{"$f":"IF(OR(H$14=\"\",H$15=\"\",H$16=\"\",H$17=\"\",F41=\"\"),\"\",\nIF(F41<=Calcs!H12,Inline,\nIF(AND(F41>Calcs!H12,F41<=Calcs!I12),Highest20,\nIF(F41>Calcs!I12,Highest10,\"\"))))","v":"Highest 20% of similar schools"},null,{"$f":"IFERROR('Optional - input raw data'!H37/'Optional - input raw data'!H23,Calcs!$A$75)","v":""},null,{"$f":"IF(OR(L$14=\"\",L$15=\"\",L$16=\"\",L$17=\"\",J41=\"\"),\"\",\nIF(J41<=Calcs!P12,Inline,\nIF(AND(J41>Calcs!P12,J41<=Calcs!Q12),Highest20,\nIF(J41>Calcs!Q12,Highest10,\"\"))))","v":""},null,{"$f":"IFERROR('Optional - input raw data'!J37/'Optional - input raw data'!J23,Calcs!$A$75)","v":""},null,{"$f":"IF(OR(P$14=\"\",P$15=\"\",P$16=\"\",P$17=\"\",N41=\"\"),\"\",\nIF(N41<=Calcs!X12,Inline,\nIF(AND(N41>Calcs!X12,N41<=Calcs!Y12),Highest20,\nIF(N41>Calcs!Y12,Highest10,\"\"))))","v":""},null,{"$f":"IFERROR('Optional - input raw data'!L37/'Optional - input raw data'!L23,Calcs!$A$75)","v":""},null,{"$f":"IF(OR(T$14=\"\",T$15=\"\",T$16=\"\",T$17=\"\",R41=\"\"),\"\",\nIF(R41<=Calcs!AF12,Inline,\nIF(AND(R41>Calcs!AF12,R41<=Calcs!AG12),Highest20,\nIF(R41>Calcs!AG12,Highest10,\"\"))))","v":""},null,{"$f":"IFERROR('Optional - input raw data'!N37/'Optional - input raw data'!N23,\"\")","v":""},null,{"$f":"IF(OR(X$14=\"\",X$15=\"\",X$16=\"\",X$17=\"\",V41=\"\"),\"\",\nIF(V41<=Calcs!AN12,Inline,\nIF(AND(V41>Calcs!AN12,V41<=Calcs!AO12),Highest20,\nIF(V41>Calcs!AO12,Highest10,\"\"))))","v":""},null,{"$f":"IFERROR('Optional - input raw data'!P37/'Optional - input raw data'!P23,\"\")","v":""},null,{"$f":"IF(OR(AB$14=\"\",AB$15=\"\",AB$16=\"\",AB$17=\"\",Z41=\"\"),\"\",\nIF(Z41<=Calcs!AV12,Inline,\nIF(AND(Z41>Calcs!AV12,Z41<=Calcs!AW12),Highest20,\nIF(Z41>Calcs!AW12,Highest10,\"\"))))","v":""},null,{"$f":"IFERROR('Optional - input raw data'!R37/'Optional - input raw data'!R23,\"\")","v":""},null,{"$f":"IF(OR(AF$14=\"\",AF$15=\"\",AF$16=\"\",AF$17=\"\",AD41=\"\"),\"\",\nIF(AD41<=Calcs!BD12,Inline,\nIF(AND(AD41>Calcs!BD12,AD41<=Calcs!BE12),Highest20,\nIF(AD41>Calcs!BE12,Highest10,\"\"))))","v":""},null,{"$f":"IFERROR('Optional - input raw data'!T37/'Optional - input raw data'!T23,\"\")","v":""},null,{"$f":"IF(OR(AJ$14=\"\",AJ$15=\"\",AJ$16=\"\",AJ$17=\"\",AH41=\"\"),\"\",\nIF(AH41<=Calcs!BL12,Inline,\nIF(AND(AH41>Calcs!BL12,AH41<=Calcs!BM12),Highest20,\nIF(AH41>Calcs!BM12,Highest10,\"\"))))","v":""},null,{"$f":"IFERROR('Optional - input raw data'!V37/'Optional - input raw data'!V23,\"\")","v":""},null,{"$f":"IF(OR(AN$14=\"\",AN$15=\"\",AN$16=\"\",AN$17=\"\",AL41=\"\"),\"\",\nIF(AL41<=Calcs!BT12,Inline,\nIF(AND(AL41>Calcs!BT12,AL41<=Calcs!BU12),Highest20,\nIF(AL41>Calcs!BU12,Highest10,\"\"))))","v":""},null,{"$f":"IFERROR('Optional - input raw data'!X37/'Optional - input raw data'!X23,\"\")","v":""},null,{"$f":"IF(OR(AR$14=\"\",AR$15=\"\",AR$16=\"\",AR$17=\"\",AP41=\"\"),\"\",\nIF(AP41<=Calcs!CB12,Inline,\nIF(AND(AP41>Calcs!CB12,AP41<=Calcs!CC12),Highest20,\nIF(AP41>Calcs!CC12,Highest10,\"\"))))","v":""},null,{"$f":"IFERROR('Optional - input raw data'!Z37/'Optional - input raw data'!Z23,\"\")","v":""},null,{"$f":"IF(OR(AV$14=\"\",AV$15=\"\",AV$16=\"\",AV$17=\"\",AT41=\"\"),\"\",\nIF(AT41<=Calcs!CJ12,Inline,\nIF(AND(AT41>Calcs!CJ12,AT41<=Calcs!CK12),Highest20,\nIF(AT41>Calcs!CK12,Highest10,\"\"))))","v":""},null,{"$f":"IFERROR('Optional - input raw data'!AB37/'Optional - input raw data'!AB23,\"\")","v":""},null,{"$f":"IF(OR(AZ$14=\"\",AZ$15=\"\",AZ$16=\"\",AZ$17=\"\",AX41=\"\"),\"\",\nIF(AX41<=Calcs!CR12,Inline,\nIF(AND(AX41>Calcs!CR12,AX41<=Calcs!CS12),Highest20,\nIF(AX41>Calcs!CS12,Highest10,\"\"))))","v":""},null,{"$f":"IFERROR('Optional - input raw data'!AD37/'Optional - input raw data'!AD23,\"\")","v":""},null,{"$f":"IF(OR(BD$14=\"\",BD$15=\"\",BD$16=\"\",BD$17=\"\",BB41=\"\"),\"\",\nIF(BB41<=Calcs!CZ12,Inline,\nIF(AND(BB41>Calcs!CZ12,BB41<=Calcs!DA12),Highest20,\nIF(BB41>Calcs!DA12,Highest10,\"\"))))","v":""},null,{"$f":"IFERROR('Optional - input raw data'!AF37/'Optional - input raw data'!AF23,\"\")","v":""},null,{"$f":"IF(OR(BH$14=\"\",BH$15=\"\",BH$16=\"\",BH$17=\"\",BF41=\"\"),\"\",\nIF(BF41<=Calcs!DH12,Inline,\nIF(AND(BF41>Calcs!DH12,BF41<=Calcs!DI12),Highest20,\nIF(BF41>Calcs!DI12,Highest10,\"\"))))","v":""},null,{"$f":"IFERROR('Optional - input raw data'!AH37/'Optional - input raw data'!AH23,\"\")","v":""},null,{"$f":"IF(OR(BL$14=\"\",BL$15=\"\",BL$16=\"\",BL$17=\"\",BJ41=\"\"),\"\",\nIF(BJ41<=Calcs!DP12,Inline,\nIF(AND(BJ41>Calcs!DP12,BJ41<=Calcs!DQ12),Highest20,\nIF(BJ41>Calcs!DQ12,Highest10,\"\"))))","v":""},null,{"$f":"IFERROR('Optional - input raw data'!AJ37/'Optional - input raw data'!AJ23,\"\")","v":""},null,{"$f":"IF(OR(BP$14=\"\",BP$15=\"\",BP$16=\"\",BP$17=\"\",BN41=\"\"),\"\",\nIF(BN41<=Calcs!DX12,Inline,\nIF(AND(BN41>Calcs!DX12,BN41<=Calcs!DY12),Highest20,\nIF(BN41>Calcs!DY12,Highest10,\"\"))))","v":""},null,{"$f":"IFERROR('Optional - input raw data'!AL37/'Optional - input raw data'!AL23,\"\")","v":""},null,{"$f":"IF(OR(BT$14=\"\",BT$15=\"\",BT$16=\"\",BT$17=\"\",BR41=\"\"),\"\",\nIF(BR41<=Calcs!EF12,Inline,\nIF(AND(BR41>Calcs!EF12,BR41<=Calcs!EG12),Highest20,\nIF(BR41>Calcs!EG12,Highest10,\"\"))))","v":""},null,{"$f":"IFERROR('Optional - input raw data'!AN37/'Optional - input raw data'!AN23,\"\")","v":""},null,{"$f":"IF(OR(BX$14=\"\",BX$15=\"\",BX$16=\"\",BX$17=\"\",BV41=\"\"),\"\",\nIF(BV41<=Calcs!EN12,Inline,\nIF(AND(BV41>Calcs!EN12,BV41<=Calcs!EO12),Highest20,\nIF(BV41>Calcs!EO12,Highest10,\"\"))))","v":""},null,{"$f":"IFERROR('Optional - input raw data'!AP37/'Optional - input raw data'!AP23,\"\")","v":""},null,{"$f":"IF(OR(CB$14=\"\",CB$15=\"\",CB$16=\"\",CB$17=\"\",BZ41=\"\"),\"\",\nIF(BZ41<=Calcs!EV12,Inline,\nIF(AND(BZ41>Calcs!EV12,BZ41<=Calcs!EW12),Highest20,\nIF(BZ41>Calcs!EW12,Highest10,\"\"))))","v":""},null,{"$f":"IFERROR('Optional - input raw data'!AR37/'Optional - input raw data'!AR23,Calcs!$A$75)","v":""},null,{"$f":"IF(OR(CF$14=\"\",CF$15=\"\",CF$16=\"\",CF$17=\"\",CD41=\"\"),\"\",\nIF(CD41<=Calcs!FD12,Inline,\nIF(AND(CD41>Calcs!FD12,CD41<=Calcs!FE12),Highest20,\nIF(CD41>Calcs!FE12,Highest10,\"\"))))","v":""}]
[null,null,"Spend on other staff costs as a percentage of total expenditure","Guidance",null,{"$f":"IFERROR(SUM('Optional - input raw data'!F40,'Optional - input raw data'!F41,'Optional - input raw data'!F42,'Optional - input raw data'!F44)/'Optional - input raw data'!F23,Calcs!$A$75)","v":{"v":0.03600892748217989,"d":"3.6%"}},null,{"$f":"IF(OR(H$14=\"\",H$15=\"\",H$16=\"\",H$17=\"\",F42=\"\"),\"\",\nIF(F42<=Calcs!H13,Inline,\nIF(AND(F42>Calcs!H13,F42<=Calcs!I13),Highest20,\nIF(F42>Calcs!I13,Highest10,\"\"))))","v":"Highest 20% of similar schools"},null,{"$f":"IFERROR(SUM('Optional - input raw data'!H40,'Optional - input raw data'!H41,'Optional - input raw data'!H42,'Optional - input raw data'!H44)/'Optional - input raw data'!H23,Calcs!$A$75)","v":""},null,{"$f":"IF(OR(L$14=\"\",L$15=\"\",L$16=\"\",L$17=\"\",J42=\"\"),\"\",\nIF(J42<=Calcs!P13,Inline,\nIF(AND(J42>Calcs!P13,J42<=Calcs!Q13),Highest20,\nIF(J42>Calcs!Q13,Highest10,\"\"))))","v":""},null,{"$f":"IFERROR(SUM('Optional - input raw data'!J40,'Optional - input raw data'!J41,'Optional - input raw data'!J42,'Optional - input raw data'!J44)/'Optional - input raw data'!J23,Calcs!$A$75)","v":""},null,{"$f":"IF(OR(P$14=\"\",P$15=\"\",P$16=\"\",P$17=\"\",N42=\"\"),\"\",\nIF(N42<=Calcs!X13,Inline,\nIF(AND(N42>Calcs!X13,N42<=Calcs!Y13),Highest20,\nIF(N42>Calcs!Y13,Highest10,\"\"))))","v":""},null,{"$f":"IFERROR(SUM('Optional - input raw data'!L40,'Optional - input raw data'!L41,'Optional - input raw data'!L42,'Optional - input raw data'!L44)/'Optional - input raw data'!L23,Calcs!$A$75)","v":""},null,{"$f":"IF(OR(T$14=\"\",T$15=\"\",T$16=\"\",T$17=\"\",R42=\"\"),\"\",\nIF(R42<=Calcs!AF13,Inline,\nIF(AND(R42>Calcs!AF13,R42<=Calcs!AG13),Highest20,\nIF(R42>Calcs!AG13,Highest10,\"\"))))","v":""},null,{"$f":"IFERROR(SUM('Optional - input raw data'!N40,'Optional - input raw data'!N41,'Optional - input raw data'!N42,'Optional - input raw data'!N44)/'Optional - input raw data'!N23,\"\")","v":""},null,{"$f":"IF(OR(X$14=\"\",X$15=\"\",X$16=\"\",X$17=\"\",V42=\"\"),\"\",\nIF(V42<=Calcs!AN13,Inline,\nIF(AND(V42>Calcs!AN13,V42<=Calcs!AO13),Highest20,\nIF(V42>Calcs!AO13,Highest10,\"\"))))","v":""},null,{"$f":"IFERROR(SUM('Optional - input raw data'!P40,'Optional - input raw data'!P41,'Optional - input raw data'!P42,'Optional - input raw data'!P44)/'Optional - input raw data'!P23,\"\")","v":""},null,{"$f":"IF(OR(AB$14=\"\",AB$15=\"\",AB$16=\"\",AB$17=\"\",Z42=\"\"),\"\",\nIF(Z42<=Calcs!AV13,Inline,\nIF(AND(Z42>Calcs!AV13,Z42<=Calcs!AW13),Highest20,\nIF(Z42>Calcs!AW13,Highest10,\"\"))))","v":""},null,{"$f":"IFERROR(SUM('Optional - input raw data'!R40,'Optional - input raw data'!R41,'Optional - input raw data'!R42,'Optional - input raw data'!R44)/'Optional - input raw data'!R23,\"\")","v":""},null,{"$f":"IF(OR(AF$14=\"\",AF$15=\"\",AF$16=\"\",AF$17=\"\",AD42=\"\"),\"\",\nIF(AD42<=Calcs!BD13,Inline,\nIF(AND(AD42>Calcs!BD13,AD42<=Calcs!BE13),Highest20,\nIF(AD42>Calcs!BE13,Highest10,\"\"))))","v":""},null,{"$f":"IFERROR(SUM('Optional - input raw data'!T40,'Optional - input raw data'!T41,'Optional - input raw data'!T42,'Optional - input raw data'!T44)/'Optional - input raw data'!T23,\"\")","v":""},null,{"$f":"IF(OR(AJ$14=\"\",AJ$15=\"\",AJ$16=\"\",AJ$17=\"\",AH42=\"\"),\"\",\nIF(AH42<=Calcs!BL13,Inline,\nIF(AND(AH42>Calcs!BL13,AH42<=Calcs!BM13),Highest20,\nIF(AH42>Calcs!BM13,Highest10,\"\"))))","v":""},null,{"$f":"IFERROR(SUM('Optional - input raw data'!V40,'Optional - input raw data'!V41,'Optional - input raw data'!V42,'Optional - input raw data'!V44)/'Optional - input raw data'!V23,\"\")","v":""},null,{"$f":"IF(OR(AN$14=\"\",AN$15=\"\",AN$16=\"\",AN$17=\"\",AL42=\"\"),\"\",\nIF(AL42<=Calcs!BT13,Inline,\nIF(AND(AL42>Calcs!BT13,AL42<=Calcs!BU13),Highest20,\nIF(AL42>Calcs!BU13,Highest10,\"\"))))","v":""},null,{"$f":"IFERROR(SUM('Optional - input raw data'!X40,'Optional - input raw data'!X41,'Optional - input raw data'!X42,'Optional - input raw data'!X44)/'Optional - input raw data'!X23,\"\")","v":""},null,{"$f":"IF(OR(AR$14=\"\",AR$15=\"\",AR$16=\"\",AR$17=\"\",AP42=\"\"),\"\",\nIF(AP42<=Calcs!CB13,Inline,\nIF(AND(AP42>Calcs!CB13,AP42<=Calcs!CC13),Highest20,\nIF(AP42>Calcs!CC13,Highest10,\"\"))))","v":""},null,{"$f":"IFERROR(SUM('Optional - input raw data'!Z40,'Optional - input raw data'!Z41,'Optional - input raw data'!Z42,'Optional - input raw data'!Z44)/'Optional - input raw data'!Z23,\"\")","v":""},null,{"$f":"IF(OR(AV$14=\"\",AV$15=\"\",AV$16=\"\",AV$17=\"\",AT42=\"\"),\"\",\nIF(AT42<=Calcs!CJ13,Inline,\nIF(AND(AT42>Calcs!CJ13,AT42<=Calcs!CK13),Highest20,\nIF(AT42>Calcs!CK13,Highest10,\"\"))))","v":""},null,{"$f":"IFERROR(SUM('Optional - input raw data'!AB40,'Optional - input raw data'!AB41,'Optional - input raw data'!AB42,'Optional - input raw data'!AB44)/'Optional - input raw data'!AB23,\"\")","v":""},null,{"$f":"IF(OR(AZ$14=\"\",AZ$15=\"\",AZ$16=\"\",AZ$17=\"\",AX42=\"\"),\"\",\nIF(AX42<=Calcs!CR13,Inline,\nIF(AND(AX42>Calcs!CR13,AX42<=Calcs!CS13),Highest20,\nIF(AX42>Calcs!CS13,Highest10,\"\"))))","v":""},null,{"$f":"IFERROR(SUM('Optional - input raw data'!AD40,'Optional - input raw data'!AD41,'Optional - input raw data'!AD42,'Optional - input raw data'!AD44)/'Optional - input raw data'!AD23,\"\")","v":""},null,{"$f":"IF(OR(BD$14=\"\",BD$15=\"\",BD$16=\"\",BD$17=\"\",BB42=\"\"),\"\",\nIF(BB42<=Calcs!CZ13,Inline,\nIF(AND(BB42>Calcs!CZ13,BB42<=Calcs!DA13),Highest20,\nIF(BB42>Calcs!DA13,Highest10,\"\"))))","v":""},null,{"$f":"IFERROR(SUM('Optional - input raw data'!AF40,'Optional - input raw data'!AF41,'Optional - input raw data'!AF42,'Optional - input raw data'!AF44)/'Optional - input raw data'!AF23,\"\")","v":""},null,{"$f":"IF(OR(BH$14=\"\",BH$15=\"\",BH$16=\"\",BH$17=\"\",BF42=\"\"),\"\",\nIF(BF42<=Calcs!DH13,Inline,\nIF(AND(BF42>Calcs!DH13,BF42<=Calcs!DI13),Highest20,\nIF(BF42>Calcs!DI13,Highest10,\"\"))))","v":""},null,{"$f":"IFERROR(SUM('Optional - input raw data'!AH40,'Optional - input raw data'!AH41,'Optional - input raw data'!AH42,'Optional - input raw data'!AH44)/'Optional - input raw data'!AH23,\"\")","v":""},null,{"$f":"IF(OR(BL$14=\"\",BL$15=\"\",BL$16=\"\",BL$17=\"\",BJ42=\"\"),\"\",\nIF(BJ42<=Calcs!DP13,Inline,\nIF(AND(BJ42>Calcs!DP13,BJ42<=Calcs!DQ13),Highest20,\nIF(BJ42>Calcs!DQ13,Highest10,\"\"))))","v":""},null,{"$f":"IFERROR(SUM('Optional - input raw data'!AJ40,'Optional - input raw data'!AJ41,'Optional - input raw data'!AJ42,'Optional - input raw data'!AJ44)/'Optional - input raw data'!AJ23,\"\")","v":""},null,{"$f":"IF(OR(BP$14=\"\",BP$15=\"\",BP$16=\"\",BP$17=\"\",BN42=\"\"),\"\",\nIF(BN42<=Calcs!DX13,Inline,\nIF(AND(BN42>Calcs!DX13,BN42<=Calcs!DY13),Highest20,\nIF(BN42>Calcs!DY13,Highest10,\"\"))))","v":""},null,{"$f":"IFERROR(SUM('Optional - input raw data'!AL40,'Optional - input raw data'!AL41,'Optional - input raw data'!AL42,'Optional - input raw data'!AL44)/'Optional - input raw data'!AL23,\"\")","v":""},null,{"$f":"IF(OR(BT$14=\"\",BT$15=\"\",BT$16=\"\",BT$17=\"\",BR42=\"\"),\"\",\nIF(BR42<=Calcs!EF13,Inline,\nIF(AND(BR42>Calcs!EF13,BR42<=Calcs!EG13),Highest20,\nIF(BR42>Calcs!EG13,Highest10,\"\"))))","v":""},null,{"$f":"IFERROR(SUM('Optional - input raw data'!AN40,'Optional - input raw data'!AN41,'Optional - input raw data'!AN42,'Optional - input raw data'!AN44)/'Optional - input raw data'!AN23,\"\")","v":""},null,{"$f":"IF(OR(BX$14=\"\",BX$15=\"\",BX$16=\"\",BX$17=\"\",BV42=\"\"),\"\",\nIF(BV42<=Calcs!EN13,Inline,\nIF(AND(BV42>Calcs!EN13,BV42<=Calcs!EO13),Highest20,\nIF(BV42>Calcs!EO13,Highest10,\"\"))))","v":""},null,{"$f":"IFERROR(SUM('Optional - input raw data'!AP40,'Optional - input raw data'!AP41,'Optional - input raw data'!AP42,'Optional - input raw data'!AP44)/'Optional - input raw data'!AP23,\"\")","v":""},null,{"$f":"IF(OR(CB$14=\"\",CB$15=\"\",CB$16=\"\",CB$17=\"\",BZ42=\"\"),\"\",\nIF(BZ42<=Calcs!EV13,Inline,\nIF(AND(BZ42>Calcs!EV13,BZ42<=Calcs!EW13),Highest20,\nIF(BZ42>Calcs!EW13,Highest10,\"\"))))","v":""},null,{"$f":"IFERROR(SUM('Optional - input raw data'!AR40,'Optional - input raw data'!AR41,'Optional - input raw data'!AR42,'Optional - input raw data'!AR44)/'Optional - input raw data'!AR23,Calcs!$A$75)","v":""},null,{"$f":"IF(OR(CF$14=\"\",CF$15=\"\",CF$16=\"\",CF$17=\"\",CD42=\"\"),\"\",\nIF(CD42<=Calcs!FD13,Inline,\nIF(AND(CD42>Calcs!FD13,CD42<=Calcs!FE13),Highest20,\nIF(CD42>Calcs!FE13,Highest10,\"\"))))","v":""}]
[null,null,"Spend on premises (including staff costs) as a percentage of total expenditure","Guidance",null,{"$f":"IFERROR(SUM('Optional - input raw data'!F38,'Optional - input raw data'!F45,'Optional - input raw data'!F46,'Optional - input raw data'!F50,'Optional - input raw data'!F65)/'Optional - input raw data'!F23,Calcs!$A$75)","v":{"v":0.05473787775144216,"d":"5.5%"}},null,{"$f":"IF(OR(H$14=\"\",H$15=\"\",H$16=\"\",H$17=\"\",F43=\"\"),\"\",\nIF(F43<=Calcs!H14,Inline,\nIF(AND(F43>Calcs!H14,F43<=Calcs!I14),Highest20,\nIF(F43>Calcs!I14,Highest10,\"\"))))","v":"Broadly in line with similar schools"},null,{"$f":"IFERROR(SUM('Optional - input raw data'!H38,'Optional - input raw data'!H45,'Optional - input raw data'!H46,'Optional - input raw data'!H50,'Optional - input raw data'!H65)/'Optional - input raw data'!H23,Calcs!$A$75)","v":""},null,{"$f":"IF(OR(L$14=\"\",L$15=\"\",L$16=\"\",L$17=\"\",J43=\"\"),\"\",\nIF(J43<=Calcs!P14,Inline,\nIF(AND(J43>Calcs!P14,J43<=Calcs!Q14),Highest20,\nIF(J43>Calcs!Q14,Highest10,\"\"))))","v":""},null,{"$f":"IFERROR(SUM('Optional - input raw data'!J38,'Optional - input raw data'!J45,'Optional - input raw data'!J46,'Optional - input raw data'!J50,'Optional - input raw data'!J65)/'Optional - input raw data'!J23,Calcs!$A$75)","v":""},null,{"$f":"IF(OR(P$14=\"\",P$15=\"\",P$16=\"\",P$17=\"\",N43=\"\"),\"\",\nIF(N43<=Calcs!X14,Inline,\nIF(AND(N43>Calcs!X14,N43<=Calcs!Y14),Highest20,\nIF(N43>Calcs!Y14,Highest10,\"\"))))","v":""},null,{"$f":"IFERROR(SUM('Optional - input raw data'!L38,'Optional - input raw data'!L45,'Optional - input raw data'!L46,'Optional - input raw data'!L50,'Optional - input raw data'!L65)/'Optional - input raw data'!L23,Calcs!$A$75)","v":""},null,{"$f":"IF(OR(T$14=\"\",T$15=\"\",T$16=\"\",T$17=\"\",R43=\"\"),\"\",\nIF(R43<=Calcs!AF14,Inline,\nIF(AND(R43>Calcs!AF14,R43<=Calcs!AG14),Highest20,\nIF(R43>Calcs!AG14,Highest10,\"\"))))","v":""},null,{"$f":"IFERROR(SUM('Optional - input raw data'!N38,'Optional - input raw data'!N45,'Optional - input raw data'!N46,'Optional - input raw data'!N50,'Optional - input raw data'!N65)/'Optional - input raw data'!N23,\"\")","v":""},null,{"$f":"IF(OR(X$14=\"\",X$15=\"\",X$16=\"\",X$17=\"\",V43=\"\"),\"\",\nIF(V43<=Calcs!AN14,Inline,\nIF(AND(V43>Calcs!AN14,V43<=Calcs!AO14),Highest20,\nIF(V43>Calcs!AO14,Highest10,\"\"))))","v":""},null,{"$f":"IFERROR(SUM('Optional - input raw data'!P38,'Optional - input raw data'!P45,'Optional - input raw data'!P46,'Optional - input raw data'!P50,'Optional - input raw data'!P65)/'Optional - input raw data'!P23,\"\")","v":""},null,{"$f":"IF(OR(AB$14=\"\",AB$15=\"\",AB$16=\"\",AB$17=\"\",Z43=\"\"),\"\",\nIF(Z43<=Calcs!AV14,Inline,\nIF(AND(Z43>Calcs!AV14,Z43<=Calcs!AW14),Highest20,\nIF(Z43>Calcs!AW14,Highest10,\"\"))))","v":""},null,{"$f":"IFERROR(SUM('Optional - input raw data'!R38,'Optional - input raw data'!R45,'Optional - input raw data'!R46,'Optional - input raw data'!R50,'Optional - input raw data'!R65)/'Optional - input raw data'!R23,\"\")","v":""},null,{"$f":"IF(OR(AF$14=\"\",AF$15=\"\",AF$16=\"\",AF$17=\"\",AD43=\"\"),\"\",\nIF(AD43<=Calcs!BD14,Inline,\nIF(AND(AD43>Calcs!BD14,AD43<=Calcs!BE14),Highest20,\nIF(AD43>Calcs!BE14,Highest10,\"\"))))","v":""},null,{"$f":"IFERROR(SUM('Optional - input raw data'!T38,'Optional - input raw data'!T45,'Optional - input raw data'!T46,'Optional - input raw data'!T50,'Optional - input raw data'!T65)/'Optional - input raw data'!T23,\"\")","v":""},null,{"$f":"IF(OR(AJ$14=\"\",AJ$15=\"\",AJ$16=\"\",AJ$17=\"\",AH43=\"\"),\"\",\nIF(AH43<=Calcs!BL14,Inline,\nIF(AND(AH43>Calcs!BL14,AH43<=Calcs!BM14),Highest20,\nIF(AH43>Calcs!BM14,Highest10,\"\"))))","v":""},null,{"$f":"IFERROR(SUM('Optional - input raw data'!V38,'Optional - input raw data'!V45,'Optional - input raw data'!V46,'Optional - input raw data'!V50,'Optional - input raw data'!V65)/'Optional - input raw data'!V23,\"\")","v":""},null,{"$f":"IF(OR(AN$14=\"\",AN$15=\"\",AN$16=\"\",AN$17=\"\",AL43=\"\"),\"\",\nIF(AL43<=Calcs!BT14,Inline,\nIF(AND(AL43>Calcs!BT14,AL43<=Calcs!BU14),Highest20,\nIF(AL43>Calcs!BU14,Highest10,\"\"))))","v":""},null,{"$f":"IFERROR(SUM('Optional - input raw data'!X38,'Optional - input raw data'!X45,'Optional - input raw data'!X46,'Optional - input raw data'!X50,'Optional - input raw data'!X65)/'Optional - input raw data'!X23,\"\")","v":""},null,{"$f":"IF(OR(AR$14=\"\",AR$15=\"\",AR$16=\"\",AR$17=\"\",AP43=\"\"),\"\",\nIF(AP43<=Calcs!CB14,Inline,\nIF(AND(AP43>Calcs!CB14,AP43<=Calcs!CC14),Highest20,\nIF(AP43>Calcs!CC14,Highest10,\"\"))))","v":""},null,{"$f":"IFERROR(SUM('Optional - input raw data'!Z38,'Optional - input raw data'!Z45,'Optional - input raw data'!Z46,'Optional - input raw data'!Z50,'Optional - input raw data'!Z65)/'Optional - input raw data'!Z23,\"\")","v":""},null,{"$f":"IF(OR(AV$14=\"\",AV$15=\"\",AV$16=\"\",AV$17=\"\",AT43=\"\"),\"\",\nIF(AT43<=Calcs!CJ14,Inline,\nIF(AND(AT43>Calcs!CJ14,AT43<=Calcs!CK14),Highest20,\nIF(AT43>Calcs!CK14,Highest10,\"\"))))","v":""},null,{"$f":"IFERROR(SUM('Optional - input raw data'!AB38,'Optional - input raw data'!AB45,'Optional - input raw data'!AB46,'Optional - input raw data'!AB50,'Optional - input raw data'!AB65)/'Optional - input raw data'!AB23,\"\")","v":""},null,{"$f":"IF(OR(AZ$14=\"\",AZ$15=\"\",AZ$16=\"\",AZ$17=\"\",AX43=\"\"),\"\",\nIF(AX43<=Calcs!CR14,Inline,\nIF(AND(AX43>Calcs!CR14,AX43<=Calcs!CS14),Highest20,\nIF(AX43>Calcs!CS14,Highest10,\"\"))))","v":""},null,{"$f":"IFERROR(SUM('Optional - input raw data'!AD38,'Optional - input raw data'!AD45,'Optional - input raw data'!AD46,'Optional - input raw data'!AD50,'Optional - input raw data'!AD65)/'Optional - input raw data'!AD23,\"\")","v":""},null,{"$f":"IF(OR(BD$14=\"\",BD$15=\"\",BD$16=\"\",BD$17=\"\",BB43=\"\"),\"\",\nIF(BB43<=Calcs!CZ14,Inline,\nIF(AND(BB43>Calcs!CZ14,BB43<=Calcs!DA14),Highest20,\nIF(BB43>Calcs!DA14,Highest10,\"\"))))","v":""},null,{"$f":"IFERROR(SUM('Optional - input raw data'!AF38,'Optional - input raw data'!AF45,'Optional - input raw data'!AF46,'Optional - input raw data'!AF50,'Optional - input raw data'!AF65)/'Optional - input raw data'!AF23,\"\")","v":""},null,{"$f":"IF(OR(BH$14=\"\",BH$15=\"\",BH$16=\"\",BH$17=\"\",BF43=\"\"),\"\",\nIF(BF43<=Calcs!DH14,Inline,\nIF(AND(BF43>Calcs!DH14,BF43<=Calcs!DI14),Highest20,\nIF(BF43>Calcs!DI14,Highest10,\"\"))))","v":""},null,{"$f":"IFERROR(SUM('Optional - input raw data'!AH38,'Optional - input raw data'!AH45,'Optional - input raw data'!AH46,'Optional - input raw data'!AH50,'Optional - input raw data'!AH65)/'Optional - input raw data'!AH23,\"\")","v":""},null,{"$f":"IF(OR(BL$14=\"\",BL$15=\"\",BL$16=\"\",BL$17=\"\",BJ43=\"\"),\"\",\nIF(BJ43<=Calcs!DP14,Inline,\nIF(AND(BJ43>Calcs!DP14,BJ43<=Calcs!DQ14),Highest20,\nIF(BJ43>Calcs!DQ14,Highest10,\"\"))))","v":""},null,{"$f":"IFERROR(SUM('Optional - input raw data'!AJ38,'Optional - input raw data'!AJ45,'Optional - input raw data'!AJ46,'Optional - input raw data'!AJ50,'Optional - input raw data'!AJ65)/'Optional - input raw data'!AJ23,\"\")","v":""},null,{"$f":"IF(OR(BP$14=\"\",BP$15=\"\",BP$16=\"\",BP$17=\"\",BN43=\"\"),\"\",\nIF(BN43<=Calcs!DX14,Inline,\nIF(AND(BN43>Calcs!DX14,BN43<=Calcs!DY14),Highest20,\nIF(BN43>Calcs!DY14,Highest10,\"\"))))","v":""},null,{"$f":"IFERROR(SUM('Optional - input raw data'!AL38,'Optional - input raw data'!AL45,'Optional - input raw data'!AL46,'Optional - input raw data'!AL50,'Optional - input raw data'!AL65)/'Optional - input raw data'!AL23,\"\")","v":""},null,{"$f":"IF(OR(BT$14=\"\",BT$15=\"\",BT$16=\"\",BT$17=\"\",BR43=\"\"),\"\",\nIF(BR43<=Calcs!EF14,Inline,\nIF(AND(BR43>Calcs!EF14,BR43<=Calcs!EG14),Highest20,\nIF(BR43>Calcs!EG14,Highest10,\"\"))))","v":""},null,{"$f":"IFERROR(SUM('Optional - input raw data'!AN38,'Optional - input raw data'!AN45,'Optional - input raw data'!AN46,'Optional - input raw data'!AN50,'Optional - input raw data'!AN65)/'Optional - input raw data'!AN23,\"\")","v":""},null,{"$f":"IF(OR(BX$14=\"\",BX$15=\"\",BX$16=\"\",BX$17=\"\",BV43=\"\"),\"\",\nIF(BV43<=Calcs!EN14,Inline,\nIF(AND(BV43>Calcs!EN14,BV43<=Calcs!EO14),Highest20,\nIF(BV43>Calcs!EO14,Highest10,\"\"))))","v":""},null,{"$f":"IFERROR(SUM('Optional - input raw data'!AP38,'Optional - input raw data'!AP45,'Optional - input raw data'!AP46,'Optional - input raw data'!AP50,'Optional - input raw data'!AP65)/'Optional - input raw data'!AP23,\"\")","v":""},null,{"$f":"IF(OR(CB$14=\"\",CB$15=\"\",CB$16=\"\",CB$17=\"\",BZ43=\"\"),\"\",\nIF(BZ43<=Calcs!EV14,Inline,\nIF(AND(BZ43>Calcs!EV14,BZ43<=Calcs!EW14),Highest20,\nIF(BZ43>Calcs!EW14,Highest10,\"\"))))","v":""},null,{"$f":"IFERROR(SUM('Optional - input raw data'!AR38,'Optional - input raw data'!AR45,'Optional - input raw data'!AR46,'Optional - input raw data'!AR50,'Optional - input raw data'!AR65)/'Optional - input raw data'!AR23,Calcs!$A$75)","v":""},null,{"$f":"IF(OR(CF$14=\"\",CF$15=\"\",CF$16=\"\",CF$17=\"\",CD43=\"\"),\"\",\nIF(CD43<=Calcs!FD14,Inline,\nIF(AND(CD43>Calcs!FD14,CD43<=Calcs!FE14),Highest20,\nIF(CD43>Calcs!FE14,Highest10,\"\"))))","v":""}]
[null,null,"Spend on teaching resources as a percentage of total expenditure","Guidance",null,{"$f":"IFERROR(SUM('Optional - input raw data'!F53,'Optional - input raw data'!F54,'Optional - input raw data'!F55)/'Optional - input raw data'!F23,Calcs!$A$75)","v":{"v":0.05033009681242266,"d":"5.0%"}},null,{"$f":"IF(OR(H$14=\"\",H$15=\"\",H$16=\"\",H$17=\"\",F44=\"\"),\"\",\nIF(F44<=Calcs!C15,Lowest10,\nIF(AND(F44>Calcs!C15,F44<=Calcs!D15),Lowest20,\nIF(AND(F44>Calcs!D15,F44<=Calcs!E15),Inline,\nIF(AND(F44>Calcs!E15,F44<=Calcs!G15),Middle20,\nIF(F44>Calcs!G15,Inline,\"\"))))))","v":"Lowest 20% of similar schools"},null,{"$f":"IFERROR(SUM('Optional - input raw data'!H53,'Optional - input raw data'!H54,'Optional - input raw data'!H55)/'Optional - input raw data'!H23,Calcs!$A$75)","v":""},null,{"$f":"IF(OR(L$14=\"\",L$15=\"\",L$16=\"\",L$17=\"\",J44=\"\"),\"\",\nIF(J44<=Calcs!K15,Lowest10,\nIF(AND(J44>Calcs!K15,J44<=Calcs!L15),Lowest20,\nIF(AND(J44>Calcs!L15,J44<=Calcs!M15),Inline,\nIF(AND(J44>Calcs!M15,J44<=Calcs!O15),Middle20,\nIF(J44>Calcs!O15,Inline,\"\"))))))","v":""},null,{"$f":"IFERROR(SUM('Optional - input raw data'!J53,'Optional - input raw data'!J54,'Optional - input raw data'!J55)/'Optional - input raw data'!J23,Calcs!$A$75)","v":""},null,{"$f":"IF(OR(P$14=\"\",P$15=\"\",P$16=\"\",P$17=\"\",N44=\"\"),\"\",\nIF(N44<=Calcs!S15,Lowest10,\nIF(AND(N44>Calcs!S15,N44<=Calcs!T15),Lowest20,\nIF(AND(N44>Calcs!T15,N44<=Calcs!U15),Inline,\nIF(AND(N44>Calcs!U15,N44<=Calcs!W15),Middle20,\nIF(N44>Calcs!W15,Inline,\"\"))))))","v":""},null,{"$f":"IFERROR(SUM('Optional - input raw data'!L53,'Optional - input raw data'!L54,'Optional - input raw data'!L55)/'Optional - input raw data'!L23,Calcs!$A$75)","v":""},null,{"$f":"IF(OR(T$14=\"\",T$15=\"\",T$16=\"\",T$17=\"\",R44=\"\"),\"\",\nIF(R44<=Calcs!AA15,Lowest10,\nIF(AND(R44>Calcs!AA15,R44<=Calcs!AB15),Lowest20,\nIF(AND(R44>Calcs!AB15,R44<=Calcs!AC15),Inline,\nIF(AND(R44>Calcs!AC15,R44<=Calcs!AE15),Middle20,\nIF(R44>Calcs!AE15,Inline,\"\"))))))","v":""},null,{"$f":"IFERROR(SUM('Optional - input raw data'!N53,'Optional - input raw data'!N54,'Optional - input raw data'!N55)/'Optional - input raw data'!N23,\"\")","v":""},null,{"$f":"IF(OR(X$14=\"\",X$15=\"\",X$16=\"\",X$17=\"\",V44=\"\"),\"\",\nIF(V44<=Calcs!AI15,Lowest10,\nIF(AND(V44>Calcs!AI15,V44<=Calcs!AJ15),Lowest20,\nIF(AND(V44>Calcs!AJ15,V44<=Calcs!AK15),Inline,\nIF(AND(V44>Calcs!AK15,V44<=Calcs!AM15),Middle20,\nIF(V44>Calcs!AM15,Inline,\"\"))))))","v":""},null,{"$f":"IFERROR(SUM('Optional - input raw data'!P53,'Optional - input raw data'!P54,'Optional - input raw data'!P55)/'Optional - input raw data'!P23,\"\")","v":""},null,{"$f":"IF(OR(AB$14=\"\",AB$15=\"\",AB$16=\"\",AB$17=\"\",Z44=\"\"),\"\",\nIF(Z44<=Calcs!AQ15,Lowest10,\nIF(AND(Z44>Calcs!AQ15,Z44<=Calcs!AR15),Lowest20,\nIF(AND(Z44>Calcs!AR15,Z44<=Calcs!AS15),Inline,\nIF(AND(Z44>Calcs!AS15,Z44<=Calcs!AU15),Middle20,\nIF(Z44>Calcs!AU15,Inline,\"\"))))))","v":""},null,{"$f":"IFERROR(SUM('Optional - input raw data'!R53,'Optional - input raw data'!R54,'Optional - input raw data'!R55)/'Optional - input raw data'!R23,\"\")","v":""},null,{"$f":"IF(OR(AF$14=\"\",AF$15=\"\",AF$16=\"\",AF$17=\"\",AD44=\"\"),\"\",\nIF(AD44<=Calcs!AY15,Lowest10,\nIF(AND(AD44>Calcs!AY15,AD44<=Calcs!AZ15),Lowest20,\nIF(AND(AD44>Calcs!AZ15,AD44<=Calcs!BA15),Inline,\nIF(AND(AD44>Calcs!BA15,AD44<=Calcs!BC15),Middle20,\nIF(AD44>Calcs!BC15,Inline,\"\"))))))","v":""},null,{"$f":"IFERROR(SUM('Optional - input raw data'!T53,'Optional - input raw data'!T54,'Optional - input raw data'!T55)/'Optional - input raw data'!T23,\"\")","v":""},null,{"$f":"IF(OR(AJ$14=\"\",AJ$15=\"\",AJ$16=\"\",AJ$17=\"\",AH44=\"\"),\"\",\nIF(AH44<=Calcs!BG15,Lowest10,\nIF(AND(AH44>Calcs!BG15,AH44<=Calcs!BH15),Lowest20,\nIF(AND(AH44>Calcs!BH15,AH44<=Calcs!BI15),Inline,\nIF(AND(AH44>Calcs!BI15,AH44<=Calcs!BK15),Middle20,\nIF(AH44>Calcs!BK15,Inline,\"\"))))))","v":""},null,{"$f":"IFERROR(SUM('Optional - input raw data'!V53,'Optional - input raw data'!V54,'Optional - input raw data'!V55)/'Optional - input raw data'!V23,\"\")","v":""},null,{"$f":"IF(OR(AN$14=\"\",AN$15=\"\",AN$16=\"\",AN$17=\"\",AL44=\"\"),\"\",\nIF(AL44<=Calcs!BO15,Lowest10,\nIF(AND(AL44>Calcs!BO15,AL44<=Calcs!BP15),Lowest20,\nIF(AND(AL44>Calcs!BP15,AL44<=Calcs!BQ15),Inline,\nIF(AND(AL44>Calcs!BQ15,AL44<=Calcs!BS15),Middle20,\nIF(AL44>Calcs!BS15,Inline,\"\"))))))","v":""},null,{"$f":"IFERROR(SUM('Optional - input raw data'!X53,'Optional - input raw data'!X54,'Optional - input raw data'!X55)/'Optional - input raw data'!X23,\"\")","v":""},null,{"$f":"IF(OR(AR$14=\"\",AR$15=\"\",AR$16=\"\",AR$17=\"\",AP44=\"\"),\"\",\nIF(AP44<=Calcs!BW15,Lowest10,\nIF(AND(AP44>Calcs!BW15,AP44<=Calcs!BX15),Lowest20,\nIF(AND(AP44>Calcs!BX15,AP44<=Calcs!BY15),Inline,\nIF(AND(AP44>Calcs!BY15,AP44<=Calcs!CA15),Middle20,\nIF(AP44>Calcs!CA15,Inline,\"\"))))))","v":""},null,{"$f":"IFERROR(SUM('Optional - input raw data'!Z53,'Optional - input raw data'!Z54,'Optional - input raw data'!Z55)/'Optional - input raw data'!Z23,\"\")","v":""},null,{"$f":"IF(OR(AV$14=\"\",AV$15=\"\",AV$16=\"\",AV$17=\"\",AT44=\"\"),\"\",\nIF(AT44<=Calcs!CE15,Lowest10,\nIF(AND(AT44>Calcs!CE15,AT44<=Calcs!CF15),Lowest20,\nIF(AND(AT44>Calcs!CF15,AT44<=Calcs!CG15),Inline,\nIF(AND(AT44>Calcs!CG15,AT44<=Calcs!CI15),Middle20,\nIF(AT44>Calcs!CI15,Inline,\"\"))))))","v":""},null,{"$f":"IFERROR(SUM('Optional - input raw data'!AB53,'Optional - input raw data'!AB54,'Optional - input raw data'!AB55)/'Optional - input raw data'!AB23,\"\")","v":""},null,{"$f":"IF(OR(AZ$14=\"\",AZ$15=\"\",AZ$16=\"\",AZ$17=\"\",AX44=\"\"),\"\",\nIF(AX44<=Calcs!CM15,Lowest10,\nIF(AND(AX44>Calcs!CM15,AX44<=Calcs!CN15),Lowest20,\nIF(AND(AX44>Calcs!CN15,AX44<=Calcs!CO15),Inline,\nIF(AND(AX44>Calcs!CO15,AX44<=Calcs!CQ15),Middle20,\nIF(AX44>Calcs!CQ15,Inline,\"\"))))))","v":""},null,{"$f":"IFERROR(SUM('Optional - input raw data'!AD53,'Optional - input raw data'!AD54,'Optional - input raw data'!AD55)/'Optional - input raw data'!AD23,\"\")","v":""},null,{"$f":"IF(OR(BD$14=\"\",BD$15=\"\",BD$16=\"\",BD$17=\"\",BB44=\"\"),\"\",\nIF(BB44<=Calcs!CU15,Lowest10,\nIF(AND(BB44>Calcs!CU15,BB44<=Calcs!CV15),Lowest20,\nIF(AND(BB44>Calcs!CV15,BB44<=Calcs!CW15),Inline,\nIF(AND(BB44>Calcs!CW15,BB44<=Calcs!CY15),Middle20,\nIF(BB44>Calcs!CY15,Inline,\"\"))))))","v":""},null,{"$f":"IFERROR(SUM('Optional - input raw data'!AF53,'Optional - input raw data'!AF54,'Optional - input raw data'!AF55)/'Optional - input raw data'!AF23,\"\")","v":""},null,{"$f":"IF(OR(BH$14=\"\",BH$15=\"\",BH$16=\"\",BH$17=\"\",BF44=\"\"),\"\",\nIF(BF44<=Calcs!DC15,Lowest10,\nIF(AND(BF44>Calcs!DC15,BF44<=Calcs!DD15),Lowest20,\nIF(AND(BF44>Calcs!DD15,BF44<=Calcs!DE15),Inline,\nIF(AND(BF44>Calcs!DE15,BF44<=Calcs!DG15),Middle20,\nIF(BF44>Calcs!DG15,Inline,\"\"))))))","v":""},null,{"$f":"IFERROR(SUM('Optional - input raw data'!AH53,'Optional - input raw data'!AH54,'Optional - input raw data'!AH55)/'Optional - input raw data'!AH23,\"\")","v":""},null,{"$f":"IF(OR(BL$14=\"\",BL$15=\"\",BL$16=\"\",BL$17=\"\",BJ44=\"\"),\"\",\nIF(BJ44<=Calcs!DK15,Lowest10,\nIF(AND(BJ44>Calcs!DK15,BJ44<=Calcs!DL15),Lowest20,\nIF(AND(BJ44>Calcs!DL15,BJ44<=Calcs!DM15),Inline,\nIF(AND(BJ44>Calcs!DM15,BJ44<=Calcs!DO15),Middle20,\nIF(BJ44>Calcs!DO15,Inline,\"\"))))))","v":""},null,{"$f":"IFERROR(SUM('Optional - input raw data'!AJ53,'Optional - input raw data'!AJ54,'Optional - input raw data'!AJ55)/'Optional - input raw data'!AJ23,\"\")","v":""},null,{"$f":"IF(OR(BP$14=\"\",BP$15=\"\",BP$16=\"\",BP$17=\"\",BN44=\"\"),\"\",\nIF(BN44<=Calcs!DS15,Lowest10,\nIF(AND(BN44>Calcs!DS15,BN44<=Calcs!DT15),Lowest20,\nIF(AND(BN44>Calcs!DT15,BN44<=Calcs!DU15),Inline,\nIF(AND(BN44>Calcs!DU15,BN44<=Calcs!DW15),Middle20,\nIF(BN44>Calcs!DW15,Inline,\"\"))))))","v":""},null,{"$f":"IFERROR(SUM('Optional - input raw data'!AL53,'Optional - input raw data'!AL54,'Optional - input raw data'!AL55)/'Optional - input raw data'!AL23,\"\")","v":""},null,{"$f":"IF(OR(BT$14=\"\",BT$15=\"\",BT$16=\"\",BT$17=\"\",BR44=\"\"),\"\",\nIF(BR44<=Calcs!EA15,Lowest10,\nIF(AND(BR44>Calcs!EA15,BR44<=Calcs!EB15),Lowest20,\nIF(AND(BR44>Calcs!EB15,BR44<=Calcs!EC15),Inline,\nIF(AND(BR44>Calcs!EC15,BR44<=Calcs!EE15),Middle20,\nIF(BR44>Calcs!EE15,Inline,\"\"))))))","v":""},null,{"$f":"IFERROR(SUM('Optional - input raw data'!AN53,'Optional - input raw data'!AN54,'Optional - input raw data'!AN55)/'Optional - input raw data'!AN23,\"\")","v":""},null,{"$f":"IF(OR(BX$14=\"\",BX$15=\"\",BX$16=\"\",BX$17=\"\",BV44=\"\"),\"\",\nIF(BV44<=Calcs!EI15,Lowest10,\nIF(AND(BV44>Calcs!EI15,BV44<=Calcs!EJ15),Lowest20,\nIF(AND(BV44>Calcs!EJ15,BV44<=Calcs!EK15),Inline,\nIF(AND(BV44>Calcs!EK15,BV44<=Calcs!EM15),Middle20,\nIF(BV44>Calcs!EM15,Inline,\"\"))))))","v":""},null,{"$f":"IFERROR(SUM('Optional - input raw data'!AP53,'Optional - input raw data'!AP54,'Optional - input raw data'!AP55)/'Optional - input raw data'!AP23,\"\")","v":""},null,{"$f":"IF(OR(CB$14=\"\",CB$15=\"\",CB$16=\"\",CB$17=\"\",BZ44=\"\"),\"\",\nIF(BZ44<=Calcs!EQ15,Lowest10,\nIF(AND(BZ44>Calcs!EQ15,BZ44<=Calcs!ER15),Lowest20,\nIF(AND(BZ44>Calcs!ER15,BZ44<=Calcs!ES15),Inline,\nIF(AND(BZ44>Calcs!ES15,BZ44<=Calcs!EU15),Middle20,\nIF(BZ44>Calcs!EU15,Inline,\"\"))))))","v":""},null,{"$f":"IFERROR(SUM('Optional - input raw data'!AR53,'Optional - input raw data'!AR54,'Optional - input raw data'!AR55)/'Optional - input raw data'!AR23,Calcs!$A$75)","v":""},null,{"$f":"IF(OR(CF$14=\"\",CF$15=\"\",CF$16=\"\",CF$17=\"\",CD44=\"\"),\"\",\nIF(CD44<=Calcs!EY15,Lowest10,\nIF(AND(CD44>Calcs!EY15,CD44<=Calcs!EZ15),Lowest20,\nIF(AND(CD44>Calcs!EZ15,CD44<=Calcs!FA15),Inline,\nIF(AND(CD44>Calcs!FA15,CD44<=Calcs!FC15),Middle20,\nIF(CD44>Calcs!FC15,Inline,\"\"))))))","v":""}]
[null,null,"Spend on energy as a percentage of total expenditure","Guidance",null,{"$f":"IFERROR('Optional - input raw data'!F48/'Optional - input raw data'!F23,Calcs!$A$75)","v":{"v":0.0196064762369508,"d":"2.0%"}},null,{"$f":"IF(OR(H$14=\"\",H$15=\"\",H$16=\"\",H$17=\"\",F45=\"\"),\"\",\nIF(F45<=Calcs!H16,Inline,\nIF(AND(F45>Calcs!H16,F45<=Calcs!I16),Highest20,\nIF(F45>Calcs!I16,Highest10,\"\"))))","v":"Highest 20% of similar schools"},null,{"$f":"IFERROR('Optional - input raw data'!H48/'Optional - input raw data'!H23,Calcs!$A$75)","v":""},null,{"$f":"IF(OR(L$14=\"\",L$15=\"\",L$16=\"\",L$17=\"\",J45=\"\"),\"\",\nIF(J45<=Calcs!P16,Inline,\nIF(AND(J45>Calcs!P16,J45<=Calcs!Q16),Highest20,\nIF(J45>Calcs!Q16,Highest10,\"\"))))","v":""},null,{"$f":"IFERROR('Optional - input raw data'!J48/'Optional - input raw data'!J23,Calcs!$A$75)","v":""},null,{"$f":"IF(OR(P$14=\"\",P$15=\"\",P$16=\"\",P$17=\"\",N45=\"\"),\"\",\nIF(N45<=Calcs!X16,Inline,\nIF(AND(N45>Calcs!X16,N45<=Calcs!Y16),Highest20,\nIF(N45>Calcs!Y16,Highest10,\"\"))))","v":""},null,{"$f":"IFERROR('Optional - input raw data'!L48/'Optional - input raw data'!L23,Calcs!$A$75)","v":""},null,{"$f":"IF(OR(T$14=\"\",T$15=\"\",T$16=\"\",T$17=\"\",R45=\"\"),\"\",\nIF(R45<=Calcs!AF16,Inline,\nIF(AND(R45>Calcs!AF16,R45<=Calcs!AG16),Highest20,\nIF(R45>Calcs!AG16,Highest10,\"\"))))","v":""},null,{"$f":"IFERROR('Optional - input raw data'!N48/'Optional - input raw data'!N23,\"\")","v":""},null,{"$f":"IF(OR(X$14=\"\",X$15=\"\",X$16=\"\",X$17=\"\",V45=\"\"),\"\",\nIF(V45<=Calcs!AN16,Inline,\nIF(AND(V45>Calcs!AN16,V45<=Calcs!AO16),Highest20,\nIF(V45>Calcs!AO16,Highest10,\"\"))))","v":""},null,{"$f":"IFERROR('Optional - input raw data'!P48/'Optional - input raw data'!P23,\"\")","v":""},null,{"$f":"IF(OR(AB$14=\"\",AB$15=\"\",AB$16=\"\",AB$17=\"\",Z45=\"\"),\"\",\nIF(Z45<=Calcs!AV16,Inline,\nIF(AND(Z45>Calcs!AV16,Z45<=Calcs!AW16),Highest20,\nIF(Z45>Calcs!AW16,Highest10,\"\"))))","v":""},null,{"$f":"IFERROR('Optional - input raw data'!R48/'Optional - input raw data'!R23,\"\")","v":""},null,{"$f":"IF(OR(AF$14=\"\",AF$15=\"\",AF$16=\"\",AF$17=\"\",AD45=\"\"),\"\",\nIF(AD45<=Calcs!BD16,Inline,\nIF(AND(AD45>Calcs!BD16,AD45<=Calcs!BE16),Highest20,\nIF(AD45>Calcs!BE16,Highest10,\"\"))))","v":""},null,{"$f":"IFERROR('Optional - input raw data'!T48/'Optional - input raw data'!T23,\"\")","v":""},null,{"$f":"IF(OR(AJ$14=\"\",AJ$15=\"\",AJ$16=\"\",AJ$17=\"\",AH45=\"\"),\"\",\nIF(AH45<=Calcs!BL16,Inline,\nIF(AND(AH45>Calcs!BL16,AH45<=Calcs!BM16),Highest20,\nIF(AH45>Calcs!BM16,Highest10,\"\"))))","v":""},null,{"$f":"IFERROR('Optional - input raw data'!V48/'Optional - input raw data'!V23,\"\")","v":""},null,{"$f":"IF(OR(AN$14=\"\",AN$15=\"\",AN$16=\"\",AN$17=\"\",AL45=\"\"),\"\",\nIF(AL45<=Calcs!BT16,Inline,\nIF(AND(AL45>Calcs!BT16,AL45<=Calcs!BU16),Highest20,\nIF(AL45>Calcs!BU16,Highest10,\"\"))))","v":""},null,{"$f":"IFERROR('Optional - input raw data'!X48/'Optional - input raw data'!X23,\"\")","v":""},null,{"$f":"IF(OR(AR$14=\"\",AR$15=\"\",AR$16=\"\",AR$17=\"\",AP45=\"\"),\"\",\nIF(AP45<=Calcs!CB16,Inline,\nIF(AND(AP45>Calcs!CB16,AP45<=Calcs!CC16),Highest20,\nIF(AP45>Calcs!CC16,Highest10,\"\"))))","v":""},null,{"$f":"IFERROR('Optional - input raw data'!Z48/'Optional - input raw data'!Z23,\"\")","v":""},null,{"$f":"IF(OR(AV$14=\"\",AV$15=\"\",AV$16=\"\",AV$17=\"\",AT45=\"\"),\"\",\nIF(AT45<=Calcs!CJ16,Inline,\nIF(AND(AT45>Calcs!CJ16,AT45<=Calcs!CK16),Highest20,\nIF(AT45>Calcs!CK16,Highest10,\"\"))))","v":""},null,{"$f":"IFERROR('Optional - input raw data'!AB48/'Optional - input raw data'!AB23,\"\")","v":""},null,{"$f":"IF(OR(AZ$14=\"\",AZ$15=\"\",AZ$16=\"\",AZ$17=\"\",AX45=\"\"),\"\",\nIF(AX45<=Calcs!CR16,Inline,\nIF(AND(AX45>Calcs!CR16,AX45<=Calcs!CS16),Highest20,\nIF(AX45>Calcs!CS16,Highest10,\"\"))))","v":""},null,{"$f":"IFERROR('Optional - input raw data'!AD48/'Optional - input raw data'!AD23,\"\")","v":""},null,{"$f":"IF(OR(BD$14=\"\",BD$15=\"\",BD$16=\"\",BD$17=\"\",BB45=\"\"),\"\",\nIF(BB45<=Calcs!CZ16,Inline,\nIF(AND(BB45>Calcs!CZ16,BB45<=Calcs!DA16),Highest20,\nIF(BB45>Calcs!DA16,Highest10,\"\"))))","v":""},null,{"$f":"IFERROR('Optional - input raw data'!AF48/'Optional - input raw data'!AF23,\"\")","v":""},null,{"$f":"IF(OR(BH$14=\"\",BH$15=\"\",BH$16=\"\",BH$17=\"\",BF45=\"\"),\"\",\nIF(BF45<=Calcs!DH16,Inline,\nIF(AND(BF45>Calcs!DH16,BF45<=Calcs!DI16),Highest20,\nIF(BF45>Calcs!DI16,Highest10,\"\"))))","v":""},null,{"$f":"IFERROR('Optional - input raw data'!AH48/'Optional - input raw data'!AH23,\"\")","v":""},null,{"$f":"IF(OR(BL$14=\"\",BL$15=\"\",BL$16=\"\",BL$17=\"\",BJ45=\"\"),\"\",\nIF(BJ45<=Calcs!DP16,Inline,\nIF(AND(BJ45>Calcs!DP16,BJ45<=Calcs!DQ16),Highest20,\nIF(BJ45>Calcs!DQ16,Highest10,\"\"))))","v":""},null,{"$f":"IFERROR('Optional - input raw data'!AJ48/'Optional - input raw data'!AJ23,\"\")","v":""},null,{"$f":"IF(OR(BP$14=\"\",BP$15=\"\",BP$16=\"\",BP$17=\"\",BN45=\"\"),\"\",\nIF(BN45<=Calcs!DX16,Inline,\nIF(AND(BN45>Calcs!DX16,BN45<=Calcs!DY16),Highest20,\nIF(BN45>Calcs!DY16,Highest10,\"\"))))","v":""},null,{"$f":"IFERROR('Optional - input raw data'!AL48/'Optional - input raw data'!AL23,\"\")","v":""},null,{"$f":"IF(OR(BT$14=\"\",BT$15=\"\",BT$16=\"\",BT$17=\"\",BR45=\"\"),\"\",\nIF(BR45<=Calcs!EF16,Inline,\nIF(AND(BR45>Calcs!EF16,BR45<=Calcs!EG16),Highest20,\nIF(BR45>Calcs!EG16,Highest10,\"\"))))","v":""},null,{"$f":"IFERROR('Optional - input raw data'!AN48/'Optional - input raw data'!AN23,\"\")","v":""},null,{"$f":"IF(OR(BX$14=\"\",BX$15=\"\",BX$16=\"\",BX$17=\"\",BV45=\"\"),\"\",\nIF(BV45<=Calcs!EN16,Inline,\nIF(AND(BV45>Calcs!EN16,BV45<=Calcs!EO16),Highest20,\nIF(BV45>Calcs!EO16,Highest10,\"\"))))","v":""},null,{"$f":"IFERROR('Optional - input raw data'!AP48/'Optional - input raw data'!AP23,\"\")","v":""},null,{"$f":"IF(OR(CB$14=\"\",CB$15=\"\",CB$16=\"\",CB$17=\"\",BZ45=\"\"),\"\",\nIF(BZ45<=Calcs!EV16,Inline,\nIF(AND(BZ45>Calcs!EV16,BZ45<=Calcs!EW16),Highest20,\nIF(BZ45>Calcs!EW16,Highest10,\"\"))))","v":""},null,{"$f":"IFERROR('Optional - input raw data'!AR48/'Optional - input raw data'!AR23,Calcs!$A$75)","v":""},null,{"$f":"IF(OR(CF$14=\"\",CF$15=\"\",CF$16=\"\",CF$17=\"\",CD45=\"\"),\"\",\nIF(CD45<=Calcs!FD16,Inline,\nIF(AND(CD45>Calcs!FD16,CD45<=Calcs!FE16),Highest20,\nIF(CD45>Calcs!FE16,Highest10,\"\"))))","v":""}]
[null,null,"Other spending as a percentage of total expenditure (balancing line)","Guidance",null,{"$f":"IFERROR(SUM('Optional - input raw data'!F39,'Optional - input raw data'!F47,'Optional - input raw data'!F49,'Optional - input raw data'!F51,'Optional - input raw data'!F52,'Optional - input raw data'!F56,'Optional - input raw data'!F58,'Optional - input raw data'!F59,'Optional - input raw data'!F60,'Optional - input raw data'!F61,'Optional - input raw data'!F62,'Optional - input raw data'!F63,'Optional - input raw data'!F64)/'Optional - input raw data'!F23,Calcs!$A$75)","v":{"v":0.06755629237177364,"d":"6.8%"}},null,{"$f":"IF(OR(H$14=\"\",H$15=\"\",H$16=\"\",H$17=\"\",F46=\"\"),\"\",\"N/A\")","v":"N/A"},null,{"$f":"IFERROR(SUM('Optional - input raw data'!H39,'Optional - input raw data'!H47,'Optional - input raw data'!H49,'Optional - input raw data'!H51,'Optional - input raw data'!H52,'Optional - input raw data'!H56,'Optional - input raw data'!H58,'Optional - input raw data'!H59,'Optional - input raw data'!H60,'Optional - input raw data'!H61,'Optional - input raw data'!H62,'Optional - input raw data'!H63,'Optional - input raw data'!H64)/'Optional - input raw data'!H23,Calcs!$A$75)","v":""},null,{"$f":"IF(OR(L$14=\"\",L$15=\"\",L$16=\"\",L$17=\"\",J46=\"\"),\"\",\"N/A\")","v":""},null,{"$f":"IFERROR(SUM('Optional - input raw data'!J39,'Optional - input raw data'!J47,'Optional - input raw data'!J49,'Optional - input raw data'!J51,'Optional - input raw data'!J52,'Optional - input raw data'!J56,'Optional - input raw data'!J58,'Optional - input raw data'!J59,'Optional - input raw data'!J60,'Optional - input raw data'!J61,'Optional - input raw data'!J62,'Optional - input raw data'!J63,'Optional - input raw data'!J64)/'Optional - input raw data'!J23,Calcs!$A$75)","v":""},null,{"$f":"IF(OR(P$14=\"\",P$15=\"\",P$16=\"\",P$17=\"\",N46=\"\"),\"\",\"N/A\")","v":""},null,{"$f":"IFERROR(SUM('Optional - input raw data'!L39,'Optional - input raw data'!L47,'Optional - input raw data'!L49,'Optional - input raw data'!L51,'Optional - input raw data'!L52,'Optional - input raw data'!L56,'Optional - input raw data'!L58,'Optional - input raw data'!L59,'Optional - input raw data'!L60,'Optional - input raw data'!L61,'Optional - input raw data'!L62,'Optional - input raw data'!L63,'Optional - input raw data'!L64)/'Optional - input raw data'!L23,Calcs!$A$75)","v":""},null,{"$f":"IF(OR(T$14=\"\",T$15=\"\",T$16=\"\",T$17=\"\",R46=\"\"),\"\",\"N/A\")","v":""},null,{"$f":"IFERROR(SUM('Optional - input raw data'!N39,'Optional - input raw data'!N47,'Optional - input raw data'!N49,'Optional - input raw data'!N51,'Optional - input raw data'!N52,'Optional - input raw data'!N56,'Optional - input raw data'!N58,'Optional - input raw data'!N59,'Optional - input raw data'!N60,'Optional - input raw data'!N61,'Optional - input raw data'!N62,'Optional - input raw data'!N63,'Optional - input raw data'!N64)/'Optional - input raw data'!N23,\"\")","v":""},null,{"$f":"IF(OR(X$14=\"\",X$15=\"\",X$16=\"\",X$17=\"\",V46=\"\"),\"\",\"N/A\")","v":""},null,{"$f":"IFERROR(SUM('Optional - input raw data'!P39,'Optional - input raw data'!P47,'Optional - input raw data'!P49,'Optional - input raw data'!P51,'Optional - input raw data'!P52,'Optional - input raw data'!P56,'Optional - input raw data'!P58,'Optional - input raw data'!P59,'Optional - input raw data'!P60,'Optional - input raw data'!P61,'Optional - input raw data'!P62,'Optional - input raw data'!P63,'Optional - input raw data'!P64)/'Optional - input raw data'!P23,\"\")","v":""},null,{"$f":"IF(OR(AB$14=\"\",AB$15=\"\",AB$16=\"\",AB$17=\"\",Z46=\"\"),\"\",\"N/A\")","v":""},null,{"$f":"IFERROR(SUM('Optional - input raw data'!R39,'Optional - input raw data'!R47,'Optional - input raw data'!R49,'Optional - input raw data'!R51,'Optional - input raw data'!R52,'Optional - input raw data'!R56,'Optional - input raw data'!R58,'Optional - input raw data'!R59,'Optional - input raw data'!R60,'Optional - input raw data'!R61,'Optional - input raw data'!R62,'Optional - input raw data'!R63,'Optional - input raw data'!R64)/'Optional - input raw data'!R23,\"\")","v":""},null,{"$f":"IF(OR(AF$14=\"\",AF$15=\"\",AF$16=\"\",AF$17=\"\",AD46=\"\"),\"\",\"N/A\")","v":""},null,{"$f":"IFERROR(SUM('Optional - input raw data'!T39,'Optional - input raw data'!T47,'Optional - input raw data'!T49,'Optional - input raw data'!T51,'Optional - input raw data'!T52,'Optional - input raw data'!T56,'Optional - input raw data'!T58,'Optional - input raw data'!T59,'Optional - input raw data'!T60,'Optional - input raw data'!T61,'Optional - input raw data'!T62,'Optional - input raw data'!T63,'Optional - input raw data'!T64)/'Optional - input raw data'!T23,\"\")","v":""},null,{"$f":"IF(OR(AJ$14=\"\",AJ$15=\"\",AJ$16=\"\",AJ$17=\"\",AH46=\"\"),\"\",\"N/A\")","v":""},null,{"$f":"IFERROR(SUM('Optional - input raw data'!V39,'Optional - input raw data'!V47,'Optional - input raw data'!V49,'Optional - input raw data'!V51,'Optional - input raw data'!V52,'Optional - input raw data'!V56,'Optional - input raw data'!V58,'Optional - input raw data'!V59,'Optional - input raw data'!V60,'Optional - input raw data'!V61,'Optional - input raw data'!V62,'Optional - input raw data'!V63,'Optional - input raw data'!V64)/'Optional - input raw data'!V23,\"\")","v":""},null,{"$f":"IF(OR(AN$14=\"\",AN$15=\"\",AN$16=\"\",AN$17=\"\",AL46=\"\"),\"\",\"N/A\")","v":""},null,{"$f":"IFERROR(SUM('Optional - input raw data'!X39,'Optional - input raw data'!X47,'Optional - input raw data'!X49,'Optional - input raw data'!X51,'Optional - input raw data'!X52,'Optional - input raw data'!X56,'Optional - input raw data'!X58,'Optional - input raw data'!X59,'Optional - input raw data'!X60,'Optional - input raw data'!X61,'Optional - input raw data'!X62,'Optional - input raw data'!X63,'Optional - input raw data'!X64)/'Optional - input raw data'!X23,\"\")","v":""},null,{"$f":"IF(OR(AR$14=\"\",AR$15=\"\",AR$16=\"\",AR$17=\"\",AP46=\"\"),\"\",\"N/A\")","v":""},null,{"$f":"IFERROR(SUM('Optional - input raw data'!Z39,'Optional - input raw data'!Z47,'Optional - input raw data'!Z49,'Optional - input raw data'!Z51,'Optional - input raw data'!Z52,'Optional - input raw data'!Z56,'Optional - input raw data'!Z58,'Optional - input raw data'!Z59,'Optional - input raw data'!Z60,'Optional - input raw data'!Z61,'Optional - input raw data'!Z62,'Optional - input raw data'!Z63,'Optional - input raw data'!Z64)/'Optional - input raw data'!Z23,\"\")","v":""},null,{"$f":"IF(OR(AV$14=\"\",AV$15=\"\",AV$16=\"\",AV$17=\"\",AT46=\"\"),\"\",\"N/A\")","v":""},null,{"$f":"IFERROR(SUM('Optional - input raw data'!AB39,'Optional - input raw data'!AB47,'Optional - input raw data'!AB49,'Optional - input raw data'!AB51,'Optional - input raw data'!AB52,'Optional - input raw data'!AB56,'Optional - input raw data'!AB58,'Optional - input raw data'!AB59,'Optional - input raw data'!AB60,'Optional - input raw data'!AB61,'Optional - input raw data'!AB62,'Optional - input raw data'!AB63,'Optional - input raw data'!AB64)/'Optional - input raw data'!AB23,\"\")","v":""},null,{"$f":"IF(OR(AZ$14=\"\",AZ$15=\"\",AZ$16=\"\",AZ$17=\"\",AX46=\"\"),\"\",\"N/A\")","v":""},null,{"$f":"IFERROR(SUM('Optional - input raw data'!AD39,'Optional - input raw data'!AD47,'Optional - input raw data'!AD49,'Optional - input raw data'!AD51,'Optional - input raw data'!AD52,'Optional - input raw data'!AD56,'Optional - input raw data'!AD58,'Optional - input raw data'!AD59,'Optional - input raw data'!AD60,'Optional - input raw data'!AD61,'Optional - input raw data'!AD62,'Optional - input raw data'!AD63,'Optional - input raw data'!AD64)/'Optional - input raw data'!AD23,\"\")","v":""},null,{"$f":"IF(OR(BD$14=\"\",BD$15=\"\",BD$16=\"\",BD$17=\"\",BB46=\"\"),\"\",\"N/A\")","v":""},null,{"$f":"IFERROR(SUM('Optional - input raw data'!AF39,'Optional - input raw data'!AF47,'Optional - input raw data'!AF49,'Optional - input raw data'!AF51,'Optional - input raw data'!AF52,'Optional - input raw data'!AF56,'Optional - input raw data'!AF58,'Optional - input raw data'!AF59,'Optional - input raw data'!AF60,'Optional - input raw data'!AF61,'Optional - input raw data'!AF62,'Optional - input raw data'!AF63,'Optional - input raw data'!AF64)/'Optional - input raw data'!AF23,\"\")","v":""},null,{"$f":"IF(OR(BH$14=\"\",BH$15=\"\",BH$16=\"\",BH$17=\"\",BF46=\"\"),\"\",\"N/A\")","v":""},null,{"$f":"IFERROR(SUM('Optional - input raw data'!AH39,'Optional - input raw data'!AH47,'Optional - input raw data'!AH49,'Optional - input raw data'!AH51,'Optional - input raw data'!AH52,'Optional - input raw data'!AH56,'Optional - input raw data'!AH58,'Optional - input raw data'!AH59,'Optional - input raw data'!AH60,'Optional - input raw data'!AH61,'Optional - input raw data'!AH62,'Optional - input raw data'!AH63,'Optional - input raw data'!AH64)/'Optional - input raw data'!AH23,\"\")","v":""},null,{"$f":"IF(OR(BL$14=\"\",BL$15=\"\",BL$16=\"\",BL$17=\"\",BJ46=\"\"),\"\",\"N/A\")","v":""},null,{"$f":"IFERROR(SUM('Optional - input raw data'!AJ39,'Optional - input raw data'!AJ47,'Optional - input raw data'!AJ49,'Optional - input raw data'!AJ51,'Optional - input raw data'!AJ52,'Optional - input raw data'!AJ56,'Optional - input raw data'!AJ58,'Optional - input raw data'!AJ59,'Optional - input raw data'!AJ60,'Optional - input raw data'!AJ61,'Optional - input raw data'!AJ62,'Optional - input raw data'!AJ63,'Optional - input raw data'!AJ64)/'Optional - input raw data'!AJ23,\"\")","v":""},null,{"$f":"IF(OR(BP$14=\"\",BP$15=\"\",BP$16=\"\",BP$17=\"\",BN46=\"\"),\"\",\"N/A\")","v":""},null,{"$f":"IFERROR(SUM('Optional - input raw data'!AL39,'Optional - input raw data'!AL47,'Optional - input raw data'!AL49,'Optional - input raw data'!AL51,'Optional - input raw data'!AL52,'Optional - input raw data'!AL56,'Optional - input raw data'!AL58,'Optional - input raw data'!AL59,'Optional - input raw data'!AL60,'Optional - input raw data'!AL61,'Optional - input raw data'!AL62,'Optional - input raw data'!AL63,'Optional - input raw data'!AL64)/'Optional - input raw data'!AL23,\"\")","v":""},null,{"$f":"IF(OR(BT$14=\"\",BT$15=\"\",BT$16=\"\",BT$17=\"\",BR46=\"\"),\"\",\"N/A\")","v":""},null,{"$f":"IFERROR(SUM('Optional - input raw data'!AN39,'Optional - input raw data'!AN47,'Optional - input raw data'!AN49,'Optional - input raw data'!AN51,'Optional - input raw data'!AN52,'Optional - input raw data'!AN56,'Optional - input raw data'!AN58,'Optional - input raw data'!AN59,'Optional - input raw data'!AN60,'Optional - input raw data'!AN61,'Optional - input raw data'!AN62,'Optional - input raw data'!AN63,'Optional - input raw data'!AN64)/'Optional - input raw data'!AN23,\"\")","v":""},null,{"$f":"IF(OR(BX$14=\"\",BX$15=\"\",BX$16=\"\",BX$17=\"\",BV46=\"\"),\"\",\"N/A\")","v":""},null,{"$f":"IFERROR(SUM('Optional - input raw data'!AP39,'Optional - input raw data'!AP47,'Optional - input raw data'!AP49,'Optional - input raw data'!AP51,'Optional - input raw data'!AP52,'Optional - input raw data'!AP56,'Optional - input raw data'!AP58,'Optional - input raw data'!AP59,'Optional - input raw data'!AP60,'Optional - input raw data'!AP61,'Optional - input raw data'!AP62,'Optional - input raw data'!AP63,'Optional - input raw data'!AP64)/'Optional - input raw data'!AP23,\"\")","v":""},null,{"$f":"IF(OR(CB$14=\"\",CB$15=\"\",CB$16=\"\",CB$17=\"\",BZ46=\"\"),\"\",\"N/A\")","v":""},null,{"$f":"IFERROR(SUM('Optional - input raw data'!AR39,'Optional - input raw data'!AR47,'Optional - input raw data'!AR49,'Optional - input raw data'!AR51,'Optional - input raw data'!AR52,'Optional - input raw data'!AR56,'Optional - input raw data'!AR58,'Optional - input raw data'!AR59,'Optional - input raw data'!AR60,'Optional - input raw data'!AR61,'Optional - input raw data'!AR62,'Optional - input raw data'!AR63,'Optional - input raw data'!AR64)/'Optional - input raw data'!AR23,Calcs!$A$75)","v":""},null,{"$f":"IF(OR(CF$14=\"\",CF$15=\"\",CF$16=\"\",CF$17=\"\",CD46=\"\"),\"\",\"N/A\")","v":""}]
[{"$nulls":5},{"$f":"IF(OR(ROUND(SUM(F38:F46),3)=100%,SUM(F38:F46)=0),\"\",\"Section must sum to 100%\")","v":""},{"$nulls":3},{"$f":"IF(OR(ROUND(SUM(J38:J46),3)=100%,SUM(J38:J46)=0),\"\",\"Section must sum to 100%\")","v":""},{"$nulls":3},{"$f":"IF(OR(ROUND(SUM(N38:N46),3)=100%,SUM(N38:N46)=0),\"\",\"Section must sum to 100%\")","v":""},{"$nulls":3},{"$f":"IF(OR(ROUND(SUM(R38:R46),3)=100%,SUM(R38:R46)=0),\"\",\"Section must sum to 100%\")","v":""},{"$nulls":3},{"$f":"IF(OR(ROUND(SUM(V38:V46),3)=100%,SUM(V38:V46)=0),\"\",\"Section must sum to 100%\")","v":""},{"$nulls":3},{"$f":"IF(OR(ROUND(SUM(Z38:Z46),3)=100%,SUM(Z38:Z46)=0),\"\",\"Section must sum to 100%\")","v":""},{"$nulls":3},{"$f":"IF(OR(ROUND(SUM(AD38:AD46),3)=100%,SUM(AD38:AD46)=0),\"\",\"Section must sum to 100%\")","v":""},{"$nulls":3},{"$f":"IF(OR(ROUND(SUM(AH38:AH46),3)=100%,SUM(AH38:AH46)=0),\"\",\"Section must sum to 100%\")","v":""},{"$nulls":3},{"$f":"IF(OR(ROUND(SUM(AL38:AL46),3)=100%,SUM(AL38:AL46)=0),\"\",\"Section must sum to 100%\")","v":""},{"$nulls":3},{"$f":"IF(OR(ROUND(SUM(AP38:AP46),3)=100%,SUM(AP38:AP46)=0),\"\",\"Section must sum to 100%\")","v":""},{"$nulls":3},{"$f":"IF(OR(ROUND(SUM(AT38:AT46),3)=100%,SUM(AT38:AT46)=0),\"\",\"Section must sum to 100%\")","v":""},{"$nulls":3},{"$f":"IF(OR(ROUND(SUM(AX38:AX46),3)=100%,SUM(AX38:AX46)=0),\"\",\"Section must sum to 100%\")","v":""},{"$nulls":3},{"$f":"IF(OR(ROUND(SUM(BB38:BB46),3)=100%,SUM(BB38:BB46)=0),\"\",\"Section must sum to 100%\")","v":""},{"$nulls":3},{"$f":"IF(OR(ROUND(SUM(BF38:BF46),3)=100%,SUM(BF38:BF46)=0),\"\",\"Section must sum to 100%\")","v":""},{"$nulls":3},{"$f":"IF(OR(ROUND(SUM(BJ38:BJ46),3)=100%,SUM(BJ38:BJ46)=0),\"\",\"Section must sum to 100%\")","v":""},{"$nulls":3},{"$f":"IF(OR(ROUND(SUM(BN38:BN46),3)=100%,SUM(BN38:BN46)=0),\"\",\"Section must sum to 100%\")","v":""},{"$nulls":3},{"$f":"IF(OR(ROUND(SUM(BR38:BR46),3)=100%,SUM(BR38:BR46)=0),\"\",\"Section must sum to 100%\")","v":""},{"$nulls":3},{"$f":"IF(OR(ROUND(SUM(BV38:BV46),3)=100%,SUM(BV38:BV46)=0),\"\",\"Section must sum to 100%\")","v":""},{"$nulls":3},{"$f":"IF(OR(ROUND(SUM(BZ38:BZ46),3)=100%,SUM(BZ38:BZ46)=0),\"\",\"Section must sum to 100%\")","v":""},{"$nulls":3},{"$f":"IF(OR(ROUND(SUM(CD38:CD46),3)=100%,SUM(CD38:CD46)=0),\"\",\"Section must sum to 100%\")","v":""}]
[null,null,"C. Reserves / balances as a percentage of total income"]
[]
[null,null,"In-year balance as a percentage of total income","Guidance",null,{"$f":"IFERROR(('Optional - input raw data'!F24-'Optional - input raw data'!F23)/'Optional - input raw data'!F24,Calcs!$A$75)","v":{"v":-0.03070657139096112,"d":"-3.1%"}},null,{"$f":"IF(OR(H$14=\"\",H$15=\"\",H$16=\"\",H$17=\"\",F50=\"\"),\"\",\nIF(F50<=-0.05,High,\nIF(AND(F50>-0.05,F50<0),Medium,\nIF(F50>=0,Low,\"\"))))","v":"Medium risk"},null,{"$f":"IFERROR(('Optional - input raw data'!H24-'Optional - input raw data'!H23)/'Optional - input raw data'!H24,Calcs!$A$75)","v":""},null,{"$f":"IF(OR(L$14=\"\",L$15=\"\",L$16=\"\",L$17=\"\",J50=\"\"),\"\",\nIF(J50<=-0.05,High,\nIF(AND(J50>-0.05,J50<0),Medium,\nIF(J50>=0,Low,\"\"))))","v":""},null,{"$f":"IFERROR(('Optional - input raw data'!J24-'Optional - input raw data'!J23)/'Optional - input raw data'!J24,Calcs!$A$75)","v":""},null,{"$f":"IF(OR(P$14=\"\",P$15=\"\",P$16=\"\",P$17=\"\",N50=\"\"),\"\",\nIF(N50<=-0.05,High,\nIF(AND(N50>-0.05,N50<0),Medium,\nIF(N50>=0,Low,\"\"))))","v":""},null,{"$f":"IFERROR(('Optional - input raw data'!L24-'Optional - input raw data'!L23)/'Optional - input raw data'!L24,Calcs!$A$75)","v":""},null,{"$f":"IF(OR(T$14=\"\",T$15=\"\",T$16=\"\",T$17=\"\",R50=\"\"),\"\",\nIF(R50<=-0.05,High,\nIF(AND(R50>-0.05,R50<0),Medium,\nIF(R50>=0,Low,\"\"))))","v":""},null,{"$f":"IFERROR(('Optional - input raw data'!N24-'Optional - input raw data'!N23)/'Optional - input raw data'!N24,\"\")","v":""},null,{"$f":"IF(OR(X$14=\"\",X$15=\"\",X$16=\"\",X$17=\"\",V50=\"\"),\"\",\nIF(V50<=-0.05,High,\nIF(AND(V50>-0.05,V50<0),Medium,\nIF(V50>=0,Low,\"\"))))","v":""},null,{"$f":"IFERROR(('Optional - input raw data'!P24-'Optional - input raw data'!P23)/'Optional - input raw data'!P24,\"\")","v":""},null,{"$f":"IF(OR(AB$14=\"\",AB$15=\"\",AB$16=\"\",AB$17=\"\",Z50=\"\"),\"\",\nIF(Z50<=-0.05,High,\nIF(AND(Z50>-0.05,Z50<0),Medium,\nIF(Z50>=0,Low,\"\"))))","v":""},null,{"$f":"IFERROR(('Optional - input raw data'!R24-'Optional - input raw data'!R23)/'Optional - input raw data'!R24,\"\")","v":""},null,{"$f":"IF(OR(AF$14=\"\",AF$15=\"\",AF$16=\"\",AF$17=\"\",AD50=\"\"),\"\",\nIF(AD50<=-0.05,High,\nIF(AND(AD50>-0.05,AD50<0),Medium,\nIF(AD50>=0,Low,\"\"))))","v":""},null,{"$f":"IFERROR(('Optional - input raw data'!T24-'Optional - input raw data'!T23)/'Optional - input raw data'!T24,\"\")","v":""},null,{"$f":"IF(OR(AJ$14=\"\",AJ$15=\"\",AJ$16=\"\",AJ$17=\"\",AH50=\"\"),\"\",\nIF(AH50<=-0.05,High,\nIF(AND(AH50>-0.05,AH50<0),Medium,\nIF(AH50>=0,Low,\"\"))))","v":""},null,{"$f":"IFERROR(('Optional - input raw data'!V24-'Optional - input raw data'!V23)/'Optional - input raw data'!V24,\"\")","v":""},null,{"$f":"IF(OR(AN$14=\"\",AN$15=\"\",AN$16=\"\",AN$17=\"\",AL50=\"\"),\"\",\nIF(AL50<=-0.05,High,\nIF(AND(AL50>-0.05,AL50<0),Medium,\nIF(AL50>=0,Low,\"\"))))","v":""},null,{"$f":"IFERROR(('Optional - input raw data'!X24-'Optional - input raw data'!X23)/'Optional - input raw data'!X24,\"\")","v":""},null,{"$f":"IF(OR(AR$14=\"\",AR$15=\"\",AR$16=\"\",AR$17=\"\",AP50=\"\"),\"\",\nIF(AP50<=-0.05,High,\nIF(AND(AP50>-0.05,AP50<0),Medium,\nIF(AP50>=0,Low,\"\"))))","v":""},null,{"$f":"IFERROR(('Optional - input raw data'!Z24-'Optional - input raw data'!Z23)/'Optional - input raw data'!Z24,\"\")","v":""},null,{"$f":"IF(OR(AV$14=\"\",AV$15=\"\",AV$16=\"\",AV$17=\"\",AT50=\"\"),\"\",\nIF(AT50<=-0.05,High,\nIF(AND(AT50>-0.05,AT50<0),Medium,\nIF(AT50>=0,Low,\"\"))))","v":""},null,{"$f":"IFERROR(('Optional - input raw data'!AB24-'Optional - input raw data'!AB23)/'Optional - input raw data'!AB24,\"\")","v":""},null,{"$f":"IF(OR(AZ$14=\"\",AZ$15=\"\",AZ$16=\"\",AZ$17=\"\",AX50=\"\"),\"\",\nIF(AX50<=-0.05,High,\nIF(AND(AX50>-0.05,AX50<0),Medium,\nIF(AX50>=0,Low,\"\"))))","v":""},null,{"$f":"IFERROR(('Optional - input raw data'!AD24-'Optional - input raw data'!AD23)/'Optional - input raw data'!AD24,\"\")","v":""},null,{"$f":"IF(OR(BD$14=\"\",BD$15=\"\",BD$16=\"\",BD$17=\"\",BB50=\"\"),\"\",\nIF(BB50<=-0.05,High,\nIF(AND(BB50>-0.05,BB50<0),Medium,\nIF(BB50>=0,Low,\"\"))))","v":""},null,{"$f":"IFERROR(('Optional - input raw data'!AF24-'Optional - input raw data'!AF23)/'Optional - input raw data'!AF24,\"\")","v":""},null,{"$f":"IF(OR(BH$14=\"\",BH$15=\"\",BH$16=\"\",BH$17=\"\",BF50=\"\"),\"\",\nIF(BF50<=-0.05,High,\nIF(AND(BF50>-0.05,BF50<0),Medium,\nIF(BF50>=0,Low,\"\"))))","v":""},null,{"$f":"IFERROR(('Optional - input raw data'!AH24-'Optional - input raw data'!AH23)/'Optional - input raw data'!AH24,\"\")","v":""},null,{"$f":"IF(OR(BL$14=\"\",BL$15=\"\",BL$16=\"\",BL$17=\"\",BJ50=\"\"),\"\",\nIF(BJ50<=-0.05,High,\nIF(AND(BJ50>-0.05,BJ50<0),Medium,\nIF(BJ50>=0,Low,\"\"))))","v":""},null,{"$f":"IFERROR(('Optional - input raw data'!AJ24-'Optional - input raw data'!AJ23)/'Optional - input raw data'!AJ24,\"\")","v":""},null,{"$f":"IF(OR(BP$14=\"\",BP$15=\"\",BP$16=\"\",BP$17=\"\",BN50=\"\"),\"\",\nIF(BN50<=-0.05,High,\nIF(AND(BN50>-0.05,BN50<0),Medium,\nIF(BN50>=0,Low,\"\"))))","v":""},null,{"$f":"IFERROR(('Optional - input raw data'!AL24-'Optional - input raw data'!AL23)/'Optional - input raw data'!AL24,\"\")","v":""},null,{"$f":"IF(OR(BT$14=\"\",BT$15=\"\",BT$16=\"\",BT$17=\"\",BR50=\"\"),\"\",\nIF(BR50<=-0.05,High,\nIF(AND(BR50>-0.05,BR50<0),Medium,\nIF(BR50>=0,Low,\"\"))))","v":""},null,{"$f":"IFERROR(('Optional - input raw data'!AN24-'Optional - input raw data'!AN23)/'Optional - input raw data'!AN24,\"\")","v":""},null,{"$f":"IF(OR(BX$14=\"\",BX$15=\"\",BX$16=\"\",BX$17=\"\",BV50=\"\"),\"\",\nIF(BV50<=-0.05,High,\nIF(AND(BV50>-0.05,BV50<0),Medium,\nIF(BV50>=0,Low,\"\"))))","v":""},null,{"$f":"IFERROR(('Optional - input raw data'!AP24-'Optional - input raw data'!AP23)/'Optional - input raw data'!AP24,\"\")","v":""},null,{"$f":"IF(OR(CB$14=\"\",CB$15=\"\",CB$16=\"\",CB$17=\"\",BZ50=\"\"),\"\",\nIF(BZ50<=-0.05,High,\nIF(AND(BZ50>-0.05,BZ50<0),Medium,\nIF(BZ50>=0,Low,\"\"))))","v":""},null,{"$f":"IFERROR(('Optional - input raw data'!AR24-'Optional - input raw data'!AR23)/'Optional - input raw data'!AR24,Calcs!$A$75)","v":""},null,{"$f":"IF(OR(CF$14=\"\",CF$15=\"\",CF$16=\"\",CF$17=\"\",CD50=\"\"),\"\",\nIF(CD50<=-0.05,High,\nIF(AND(CD50>-0.05,CD50<0),Medium,\nIF(CD50>=0,Low,\"\"))))","v":""}]
[null,null,"Revenue reserve as a percentage of total income","Guidance",null,{"$f":"IFERROR('Optional - input raw data'!F25/'Optional - input raw data'!F24,Calcs!$A$75)","v":{"v":0.046254504465943445,"d":"4.6%"}},null,{"$f":"IF(OR(H$14=\"\",H$15=\"\",H$16=\"\",H$17=\"\",F51=\"\"),\"\",\nIF(F51<=-0.05,High,\nIF(AND(F51>-0.05,F51<0),Medium,\nIF(F51>=0,Low,\"\"))))","v":"Low risk"},null,{"$f":"IFERROR('Optional - input raw data'!H25/'Optional - input raw data'!H24,Calcs!$A$75)","v":""},null,{"$f":"IF(OR(L$14=\"\",L$15=\"\",L$16=\"\",L$17=\"\",J51=\"\"),\"\",\nIF(J51<=-0.05,High,\nIF(AND(J51>-0.05,J51<0),Medium,\nIF(J51>=0,Low,\"\"))))","v":""},null,{"$f":"IFERROR('Optional - input raw data'!J25/'Optional - input raw data'!J24,Calcs!$A$75)","v":""},null,{"$f":"IF(OR(P$14=\"\",P$15=\"\",P$16=\"\",P$17=\"\",N51=\"\"),\"\",\nIF(N51<=-0.05,High,\nIF(AND(N51>-0.05,N51<0),Medium,\nIF(N51>=0,Low,\"\"))))","v":""},null,{"$f":"IFERROR('Optional - input raw data'!L25/'Optional - input raw data'!L24,Calcs!$A$75)","v":""},null,{"$f":"IF(OR(T$14=\"\",T$15=\"\",T$16=\"\",T$17=\"\",R51=\"\"),\"\",\nIF(R51<=-0.05,High,\nIF(AND(R51>-0.05,R51<0),Medium,\nIF(R51>=0,Low,\"\"))))","v":""},null,{"$f":"IFERROR('Optional - input raw data'!N25/'Optional - input raw data'!N24,\"\")","v":""},null,{"$f":"IF(OR(X$14=\"\",X$15=\"\",X$16=\"\",X$17=\"\",V51=\"\"),\"\",\nIF(V51<=-0.05,High,\nIF(AND(V51>-0.05,V51<0),Medium,\nIF(V51>=0,Low,\"\"))))","v":""},null,{"$f":"IFERROR('Optional - input raw data'!P25/'Optional - input raw data'!P24,\"\")","v":""},null,{"$f":"IF(OR(AB$14=\"\",AB$15=\"\",AB$16=\"\",AB$17=\"\",Z51=\"\"),\"\",\nIF(Z51<=-0.05,High,\nIF(AND(Z51>-0.05,Z51<0),Medium,\nIF(Z51>=0,Low,\"\"))))","v":""},null,{"$f":"IFERROR('Optional - input raw data'!R25/'Optional - input raw data'!R24,\"\")","v":""},null,{"$f":"IF(OR(AF$14=\"\",AF$15=\"\",AF$16=\"\",AF$17=\"\",AD51=\"\"),\"\",\nIF(AD51<=-0.05,High,\nIF(AND(AD51>-0.05,AD51<0),Medium,\nIF(AD51>=0,Low,\"\"))))","v":""},null,{"$f":"IFERROR('Optional - input raw data'!T25/'Optional - input raw data'!T24,\"\")","v":""},null,{"$f":"IF(OR(AJ$14=\"\",AJ$15=\"\",AJ$16=\"\",AJ$17=\"\",AH51=\"\"),\"\",\nIF(AH51<=-0.05,High,\nIF(AND(AH51>-0.05,AH51<0),Medium,\nIF(AH51>=0,Low,\"\"))))","v":""},null,{"$f":"IFERROR('Optional - input raw data'!V25/'Optional - input raw data'!V24,\"\")","v":""},null,{"$f":"IF(OR(AN$14=\"\",AN$15=\"\",AN$16=\"\",AN$17=\"\",AL51=\"\"),\"\",\nIF(AL51<=-0.05,High,\nIF(AND(AL51>-0.05,AL51<0),Medium,\nIF(AL51>=0,Low,\"\"))))","v":""},null,{"$f":"IFERROR('Optional - input raw data'!X25/'Optional - input raw data'!X24,\"\")","v":""},null,{"$f":"IF(OR(AR$14=\"\",AR$15=\"\",AR$16=\"\",AR$17=\"\",AP51=\"\"),\"\",\nIF(AP51<=-0.05,High,\nIF(AND(AP51>-0.05,AP51<0),Medium,\nIF(AP51>=0,Low,\"\"))))","v":""},null,{"$f":"IFERROR('Optional - input raw data'!Z25/'Optional - input raw data'!Z24,\"\")","v":""},null,{"$f":"IF(OR(AV$14=\"\",AV$15=\"\",AV$16=\"\",AV$17=\"\",AT51=\"\"),\"\",\nIF(AT51<=-0.05,High,\nIF(AND(AT51>-0.05,AT51<0),Medium,\nIF(AT51>=0,Low,\"\"))))","v":""},null,{"$f":"IFERROR('Optional - input raw data'!AB25/'Optional - input raw data'!AB24,\"\")","v":""},null,{"$f":"IF(OR(AZ$14=\"\",AZ$15=\"\",AZ$16=\"\",AZ$17=\"\",AX51=\"\"),\"\",\nIF(AX51<=-0.05,High,\nIF(AND(AX51>-0.05,AX51<0),Medium,\nIF(AX51>=0,Low,\"\"))))","v":""},null,{"$f":"IFERROR('Optional - input raw data'!AD25/'Optional - input raw data'!AD24,\"\")","v":""},null,{"$f":"IF(OR(BD$14=\"\",BD$15=\"\",BD$16=\"\",BD$17=\"\",BB51=\"\"),\"\",\nIF(BB51<=-0.05,High,\nIF(AND(BB51>-0.05,BB51<0),Medium,\nIF(BB51>=0,Low,\"\"))))","v":""},null,{"$f":"IFERROR('Optional - input raw data'!AF25/'Optional - input raw data'!AF24,\"\")","v":""},null,{"$f":"IF(OR(BH$14=\"\",BH$15=\"\",BH$16=\"\",BH$17=\"\",BF51=\"\"),\"\",\nIF(BF51<=-0.05,High,\nIF(AND(BF51>-0.05,BF51<0),Medium,\nIF(BF51>=0,Low,\"\"))))","v":""},null,{"$f":"IFERROR('Optional - input raw data'!AH25/'Optional - input raw data'!AH24,\"\")","v":""},null,{"$f":"IF(OR(BL$14=\"\",BL$15=\"\",BL$16=\"\",BL$17=\"\",BJ51=\"\"),\"\",\nIF(BJ51<=-0.05,High,\nIF(AND(BJ51>-0.05,BJ51<0),Medium,\nIF(BJ51>=0,Low,\"\"))))","v":""},null,{"$f":"IFERROR('Optional - input raw data'!AJ25/'Optional - input raw data'!AJ24,\"\")","v":""},null,{"$f":"IF(OR(BP$14=\"\",BP$15=\"\",BP$16=\"\",BP$17=\"\",BN51=\"\"),\"\",\nIF(BN51<=-0.05,High,\nIF(AND(BN51>-0.05,BN51<0),Medium,\nIF(BN51>=0,Low,\"\"))))","v":""},null,{"$f":"IFERROR('Optional - input raw data'!AL25/'Optional - input raw data'!AL24,\"\")","v":""},null,{"$f":"IF(OR(BT$14=\"\",BT$15=\"\",BT$16=\"\",BT$17=\"\",BR51=\"\"),\"\",\nIF(BR51<=-0.05,High,\nIF(AND(BR51>-0.05,BR51<0),Medium,\nIF(BR51>=0,Low,\"\"))))","v":""},null,{"$f":"IFERROR('Optional - input raw data'!AN25/'Optional - input raw data'!AN24,\"\")","v":""},null,{"$f":"IF(OR(BX$14=\"\",BX$15=\"\",BX$16=\"\",BX$17=\"\",BV51=\"\"),\"\",\nIF(BV51<=-0.05,High,\nIF(AND(BV51>-0.05,BV51<0),Medium,\nIF(BV51>=0,Low,\"\"))))","v":""},null,{"$f":"IFERROR('Optional - input raw data'!AP25/'Optional - input raw data'!AP24,\"\")","v":""},null,{"$f":"IF(OR(CB$14=\"\",CB$15=\"\",CB$16=\"\",CB$17=\"\",BZ51=\"\"),\"\",\nIF(BZ51<=-0.05,High,\nIF(AND(BZ51>-0.05,BZ51<0),Medium,\nIF(BZ51>=0,Low,\"\"))))","v":""},null,{"$f":"IFERROR('Optional - input raw data'!AR25/'Optional - input raw data'!AR24,Calcs!$A$75)","v":""},null,{"$f":"IF(OR(CF$14=\"\",CF$15=\"\",CF$16=\"\",CF$17=\"\",CD51=\"\"),\"\",\nIF(CD51<=-0.05,High,\nIF(AND(CD51>-0.05,CD51<0),Medium,\nIF(CD51>=0,Low,\"\"))))","v":""}]
[]
[null,null,"D. School characteristics"]
[]
[null,null,"Average teacher cost (£)","Guidance",null,{"$f":"IFERROR('Optional - input raw data'!F34/'Optional - input raw data'!F19,Calcs!$A$75)","v":{"v":59691.45042338159,"d":"£59,691"}},null,{"$f":"IF(OR(H$14=\"\",H$15=\"\",H$16=\"\",H$17=\"\",F55=\"\"),\"\",\nIF(F55<=Calcs!C21,Lowest10,\nIF(AND(F55>Calcs!C21,F55<=Calcs!D21),Lowest20,\nIF(AND(F55>Calcs!D21,F55<=Calcs!E21),Inline,\nIF(AND(F55>Calcs!E21,F55<=Calcs!G21),Middle20,\nIF(AND(F55>Calcs!G21,F55<=Calcs!H21),Inline,\nIF(AND(F55>Calcs!H21,F55<=Calcs!I21),Highest20,\nIF(F55>Calcs!I21,Highest10,\"\"))))))))","v":"Broadly in line with similar schools"},null,{"$f":"IFERROR('Optional - input raw data'!H34/'Optional - input raw data'!H19,Calcs!$A$75)","v":""},null,{"$f":"IF(OR(L$14=\"\",L$15=\"\",L$16=\"\",L$17=\"\",J55=\"\"),\"\",\nIF(J55<=Calcs!K21,Lowest10,\nIF(AND(J55>Calcs!K21,J55<=Calcs!L21),Lowest20,\nIF(AND(J55>Calcs!L21,J55<=Calcs!M21),Inline,\nIF(AND(J55>Calcs!M21,J55<=Calcs!O21),Middle20,\nIF(AND(J55>Calcs!O21,J55<=Calcs!P21),Inline,\nIF(AND(J55>Calcs!P21,J55<=Calcs!Q21),Highest20,\nIF(J55>Calcs!Q21,Highest10,\"\"))))))))","v":""},null,{"$f":"IFERROR('Optional - input raw data'!J34/'Optional - input raw data'!J19,Calcs!$A$75)","v":""},null,{"$f":"IF(OR(P$14=\"\",P$15=\"\",P$16=\"\",P$17=\"\",N55=\"\"),\"\",\nIF(N55<=Calcs!S21,Lowest10,\nIF(AND(N55>Calcs!S21,N55<=Calcs!T21),Lowest20,\nIF(AND(N55>Calcs!T21,N55<=Calcs!U21),Inline,\nIF(AND(N55>Calcs!U21,N55<=Calcs!W21),Middle20,\nIF(AND(N55>Calcs!W21,N55<=Calcs!X21),Inline,\nIF(AND(N55>Calcs!X21,N55<=Calcs!Y21),Highest20,\nIF(N55>Calcs!Y21,Highest10,\"\"))))))))","v":""},null,{"$f":"IFERROR('Optional - input raw data'!L34/'Optional - input raw data'!L19,Calcs!$A$75)","v":""},null,{"$f":"IF(OR(T$14=\"\",T$15=\"\",T$16=\"\",T$17=\"\",R55=\"\"),\"\",\nIF(R55<=Calcs!AA21,Lowest10,\nIF(AND(R55>Calcs!AA21,R55<=Calcs!AB21),Lowest20,\nIF(AND(R55>Calcs!AB21,R55<=Calcs!AC21),Inline,\nIF(AND(R55>Calcs!AC21,R55<=Calcs!AE21),Middle20,\nIF(AND(R55>Calcs!AE21,R55<=Calcs!AF21),Inline,\nIF(AND(R55>Calcs!AF21,R55<=Calcs!AG21),Highest20,\nIF(R55>Calcs!AG21,Highest10,\"\"))))))))","v":""},null,{"$f":"IFERROR('Optional - input raw data'!N34/'Optional - input raw data'!N19,\"\")","v":""},null,{"$f":"IF(OR(X$14=\"\",X$15=\"\",X$16=\"\",X$17=\"\",V55=\"\"),\"\",\nIF(V55<=Calcs!AI21,Lowest10,\nIF(AND(V55>Calcs!AI21,V55<=Calcs!AJ21),Lowest20,\nIF(AND(V55>Calcs!AJ21,V55<=Calcs!AK21),Inline,\nIF(AND(V55>Calcs!AK21,V55<=Calcs!AM21),Middle20,\nIF(AND(V55>Calcs!AM21,V55<=Calcs!AN21),Inline,\nIF(AND(V55>Calcs!AN21,V55<=Calcs!AO21),Highest20,\nIF(V55>Calcs!AO21,Highest10,\"\"))))))))","v":""},null,{"$f":"IFERROR('Optional - input raw data'!P34/'Optional - input raw data'!P19,\"\")","v":""},null,{"$f":"IF(OR(AB$14=\"\",AB$15=\"\",AB$16=\"\",AB$17=\"\",Z55=\"\"),\"\",\nIF(Z55<=Calcs!AQ21,Lowest10,\nIF(AND(Z55>Calcs!AQ21,Z55<=Calcs!AR21),Lowest20,\nIF(AND(Z55>Calcs!AR21,Z55<=Calcs!AS21),Inline,\nIF(AND(Z55>Calcs!AS21,Z55<=Calcs!AU21),Middle20,\nIF(AND(Z55>Calcs!AU21,Z55<=Calcs!AV21),Inline,\nIF(AND(Z55>Calcs!AV21,Z55<=Calcs!AW21),Highest20,\nIF(Z55>Calcs!AW21,Highest10,\"\"))))))))","v":""},null,{"$f":"IFERROR('Optional - input raw data'!R34/'Optional - input raw data'!R19,\"\")","v":""},null,{"$f":"IF(OR(AF$14=\"\",AF$15=\"\",AF$16=\"\",AF$17=\"\",AD55=\"\"),\"\",\nIF(AD55<=Calcs!AY21,Lowest10,\nIF(AND(AD55>Calcs!AY21,AD55<=Calcs!AZ21),Lowest20,\nIF(AND(AD55>Calcs!AZ21,AD55<=Calcs!BA21),Inline,\nIF(AND(AD55>Calcs!BA21,AD55<=Calcs!BC21),Middle20,\nIF(AND(AD55>Calcs!BC21,AD55<=Calcs!BD21),Inline,\nIF(AND(AD55>Calcs!BD21,AD55<=Calcs!BE21),Highest20,\nIF(AD55>Calcs!BE21,Highest10,\"\"))))))))","v":""},null,{"$f":"IFERROR('Optional - input raw data'!T34/'Optional - input raw data'!T19,\"\")","v":""},null,{"$f":"IF(OR(AJ$14=\"\",AJ$15=\"\",AJ$16=\"\",AJ$17=\"\",AH55=\"\"),\"\",\nIF(AH55<=Calcs!BG21,Lowest10,\nIF(AND(AH55>Calcs!BG21,AH55<=Calcs!BH21),Lowest20,\nIF(AND(AH55>Calcs!BH21,AH55<=Calcs!BI21),Inline,\nIF(AND(AH55>Calcs!BI21,AH55<=Calcs!BK21),Middle20,\nIF(AND(AH55>Calcs!BK21,AH55<=Calcs!BL21),Inline,\nIF(AND(AH55>Calcs!BL21,AH55<=Calcs!BM21),Highest20,\nIF(AH55>Calcs!BM21,Highest10,\"\"))))))))","v":""},null,{"$f":"IFERROR('Optional - input raw data'!V34/'Optional - input raw data'!V19,\"\")","v":""},null,{"$f":"IF(OR(AN$14=\"\",AN$15=\"\",AN$16=\"\",AN$17=\"\",AL55=\"\"),\"\",\nIF(AL55<=Calcs!BO21,Lowest10,\nIF(AND(AL55>Calcs!BO21,AL55<=Calcs!BP21),Lowest20,\nIF(AND(AL55>Calcs!BP21,AL55<=Calcs!BQ21),Inline,\nIF(AND(AL55>Calcs!BQ21,AL55<=Calcs!BS21),Middle20,\nIF(AND(AL55>Calcs!BS21,AL55<=Calcs!BT21),Inline,\nIF(AND(AL55>Calcs!BT21,AL55<=Calcs!BU21),Highest20,\nIF(AL55>Calcs!BU21,Highest10,\"\"))))))))","v":""},null,{"$f":"IFERROR('Optional - input raw data'!X34/'Optional - input raw data'!X19,\"\")","v":""},null,{"$f":"IF(OR(AR$14=\"\",AR$15=\"\",AR$16=\"\",AR$17=\"\",AP55=\"\"),\"\",\nIF(AP55<=Calcs!BW21,Lowest10,\nIF(AND(AP55>Calcs!BW21,AP55<=Calcs!BX21),Lowest20,\nIF(AND(AP55>Calcs!BX21,AP55<=Calcs!BY21),Inline,\nIF(AND(AP55>Calcs!BY21,AP55<=Calcs!CA21),Middle20,\nIF(AND(AP55>Calcs!CA21,AP55<=Calcs!CB21),Inline,\nIF(AND(AP55>Calcs!CB21,AP55<=Calcs!CC21),Highest20,\nIF(AP55>Calcs!CC21,Highest10,\"\"))))))))","v":""},null,{"$f":"IFERROR('Optional - input raw data'!Z34/'Optional - input raw data'!Z19,\"\")","v":""},null,{"$f":"IF(OR(AV$14=\"\",AV$15=\"\",AV$16=\"\",AV$17=\"\",AT55=\"\"),\"\",\nIF(AT55<=Calcs!CE21,Lowest10,\nIF(AND(AT55>Calcs!CE21,AT55<=Calcs!CF21),Lowest20,\nIF(AND(AT55>Calcs!CF21,AT55<=Calcs!CG21),Inline,\nIF(AND(AT55>Calcs!CG21,AT55<=Calcs!CI21),Middle20,\nIF(AND(AT55>Calcs!CI21,AT55<=Calcs!CJ21),Inline,\nIF(AND(AT55>Calcs!CJ21,AT55<=Calcs!CK21),Highest20,\nIF(AT55>Calcs!CK21,Highest10,\"\"))))))))","v":""},null,{"$f":"IFERROR('Optional - input raw data'!AB34/'Optional - input raw data'!AB19,\"\")","v":""},null,{"$f":"IF(OR(AZ$14=\"\",AZ$15=\"\",AZ$16=\"\",AZ$17=\"\",AX55=\"\"),\"\",\nIF(AX55<=Calcs!CM21,Lowest10,\nIF(AND(AX55>Calcs!CM21,AX55<=Calcs!CN21),Lowest20,\nIF(AND(AX55>Calcs!CN21,AX55<=Calcs!CO21),Inline,\nIF(AND(AX55>Calcs!CO21,AX55<=Calcs!CQ21),Middle20,\nIF(AND(AX55>Calcs!CQ21,AX55<=Calcs!CR21),Inline,\nIF(AND(AX55>Calcs!CR21,AX55<=Calcs!CS21),Highest20,\nIF(AX55>Calcs!CS21,Highest10,\"\"))))))))","v":""},null,{"$f":"IFERROR('Optional - input raw data'!AD34/'Optional - input raw data'!AD19,\"\")","v":""},null,{"$f":"IF(OR(BD$14=\"\",BD$15=\"\",BD$16=\"\",BD$17=\"\",BB55=\"\"),\"\",\nIF(BB55<=Calcs!CU21,Lowest10,\nIF(AND(BB55>Calcs!CU21,BB55<=Calcs!CV21),Lowest20,\nIF(AND(BB55>Calcs!CV21,BB55<=Calcs!CW21),Inline,\nIF(AND(BB55>Calcs!CW21,BB55<=Calcs!CY21),Middle20,\nIF(AND(BB55>Calcs!CY21,BB55<=Calcs!CZ21),Inline,\nIF(AND(BB55>Calcs!CZ21,BB55<=Calcs!DA21),Highest20,\nIF(BB55>Calcs!DA21,Highest10,\"\"))))))))","v":""},null,{"$f":"IFERROR('Optional - input raw data'!AF34/'Optional - input raw data'!AF19,\"\")","v":""},null,{"$f":"IF(OR(BH$14=\"\",BH$15=\"\",BH$16=\"\",BH$17=\"\",BF55=\"\"),\"\",\nIF(BF55<=Calcs!DC21,Lowest10,\nIF(AND(BF55>Calcs!DC21,BF55<=Calcs!DD21),Lowest20,\nIF(AND(BF55>Calcs!DD21,BF55<=Calcs!DE21),Inline,\nIF(AND(BF55>Calcs!DE21,BF55<=Calcs!DG21),Middle20,\nIF(AND(BF55>Calcs!DG21,BF55<=Calcs!DH21),Inline,\nIF(AND(BF55>Calcs!DH21,BF55<=Calcs!DI21),Highest20,\nIF(BF55>Calcs!DI21,Highest10,\"\"))))))))","v":""},null,{"$f":"IFERROR('Optional - input raw data'!AH34/'Optional - input raw data'!AH19,\"\")","v":""},null,{"$f":"IF(OR(BL$14=\"\",BL$15=\"\",BL$16=\"\",BL$17=\"\",BJ55=\"\"),\"\",\nIF(BJ55<=Calcs!DK21,Lowest10,\nIF(AND(BJ55>Calcs!DK21,BJ55<=Calcs!DL21),Lowest20,\nIF(AND(BJ55>Calcs!DL21,BJ55<=Calcs!DM21),Inline,\nIF(AND(BJ55>Calcs!DM21,BJ55<=Calcs!DO21),Middle20,\nIF(AND(BJ55>Calcs!DO21,BJ55<=Calcs!DP21),Inline,\nIF(AND(BJ55>Calcs!DP21,BJ55<=Calcs!DQ21),Highest20,\nIF(BJ55>Calcs!DQ21,Highest10,\"\"))))))))","v":""},null,{"$f":"IFERROR('Optional - input raw data'!AJ34/'Optional - input raw data'!AJ19,\"\")","v":""},null,{"$f":"IF(OR(BP$14=\"\",BP$15=\"\",BP$16=\"\",BP$17=\"\",BN55=\"\"),\"\",\nIF(BN55<=Calcs!DS21,Lowest10,\nIF(AND(BN55>Calcs!DS21,BN55<=Calcs!DT21),Lowest20,\nIF(AND(BN55>Calcs!DT21,BN55<=Calcs!DU21),Inline,\nIF(AND(BN55>Calcs!DU21,BN55<=Calcs!DW21),Middle20,\nIF(AND(BN55>Calcs!DW21,BN55<=Calcs!DX21),Inline,\nIF(AND(BN55>Calcs!DX21,BN55<=Calcs!DY21),Highest20,\nIF(BN55>Calcs!DY21,Highest10,\"\"))))))))","v":""},null,{"$f":"IFERROR('Optional - input raw data'!AL34/'Optional - input raw data'!AL19,\"\")","v":""},null,{"$f":"IF(OR(BT$14=\"\",BT$15=\"\",BT$16=\"\",BT$17=\"\",BR55=\"\"),\"\",\nIF(BR55<=Calcs!EA21,Lowest10,\nIF(AND(BR55>Calcs!EA21,BR55<=Calcs!EB21),Lowest20,\nIF(AND(BR55>Calcs!EB21,BR55<=Calcs!EC21),Inline,\nIF(AND(BR55>Calcs!EC21,BR55<=Calcs!EE21),Middle20,\nIF(AND(BR55>Calcs!EE21,BR55<=Calcs!EF21),Inline,\nIF(AND(BR55>Calcs!EF21,BR55<=Calcs!EG21),Highest20,\nIF(BR55>Calcs!EG21,Highest10,\"\"))))))))","v":""},null,{"$f":"IFERROR('Optional - input raw data'!AN34/'Optional - input raw data'!AN19,\"\")","v":""},null,{"$f":"IF(OR(BX$14=\"\",BX$15=\"\",BX$16=\"\",BX$17=\"\",BV55=\"\"),\"\",\nIF(BV55<=Calcs!EI21,Lowest10,\nIF(AND(BV55>Calcs!EI21,BV55<=Calcs!EJ21),Lowest20,\nIF(AND(BV55>Calcs!EJ21,BV55<=Calcs!EK21),Inline,\nIF(AND(BV55>Calcs!EK21,BV55<=Calcs!EM21),Middle20,\nIF(AND(BV55>Calcs!EM21,BV55<=Calcs!EN21),Inline,\nIF(AND(BV55>Calcs!EN21,BV55<=Calcs!EO21),Highest20,\nIF(BV55>Calcs!EO21,Highest10,\"\"))))))))","v":""},null,{"$f":"IFERROR('Optional - input raw data'!AP34/'Optional - input raw data'!AP19,\"\")","v":""},null,{"$f":"IF(OR(CB$14=\"\",CB$15=\"\",CB$16=\"\",CB$17=\"\",BZ55=\"\"),\"\",\nIF(BZ55<=Calcs!EQ21,Lowest10,\nIF(AND(BZ55>Calcs!EQ21,BZ55<=Calcs!ER21),Lowest20,\nIF(AND(BZ55>Calcs!ER21,BZ55<=Calcs!ES21),Inline,\nIF(AND(BZ55>Calcs!ES21,BZ55<=Calcs!EU21),Middle20,\nIF(AND(BZ55>Calcs!EU21,BZ55<=Calcs!EV21),Inline,\nIF(AND(BZ55>Calcs!EV21,BZ55<=Calcs!EW21),Highest20,\nIF(BZ55>Calcs!EW21,Highest10,\"\"))))))))","v":""},null,{"$f":"IFERROR('Optional - input raw data'!AR34/'Optional - input raw data'!AR19,Calcs!$A$75)","v":""},null,{"$f":"IF(OR(CF$14=\"\",CF$15=\"\",CF$16=\"\",CF$17=\"\",CD55=\"\"),\"\",\nIF(CD55<=Calcs!EY21,Lowest10,\nIF(AND(CD55>Calcs!EY21,CD55<=Calcs!EZ21),Lowest20,\nIF(AND(CD55>Calcs!EZ21,CD55<=Calcs!FA21),Inline,\nIF(AND(CD55>Calcs!FA21,CD55<=Calcs!FC21),Middle20,\nIF(AND(CD55>Calcs!FC21,CD55<=Calcs!FD21),Inline,\nIF(AND(CD55>Calcs!FD21,CD55<=Calcs!FE21),Highest20,\nIF(CD55>Calcs!FE21,Highest10,\"\"))))))))","v":""}]
[null,null,"Senior leaders as a percentage of workforce","Guidance",null,{"$f":"IFERROR('Optional - input raw data'!F20/'Optional - input raw data'!F21,Calcs!$A$75)","v":{"v":0.07132667617689015,"d":"7.1%"}},null,{"$f":"IF(OR(H$14=\"\",H$15=\"\",H$16=\"\",H$17=\"\",F56=\"\"),\"\",\nIF(F56<=Calcs!E17,Inline,\nIF(AND(F56>Calcs!E17,F56<=Calcs!G17),Middle20,\nIF(AND(F56>Calcs!G17,F56<=Calcs!H17),Inline,\nIF(AND(F56>Calcs!H17,F56<=Calcs!I17),Highest20,\nIF(F56>Calcs!I17,Highest10,\"\"))))))","v":"Highest 20% of similar schools"},null,{"$f":"IFERROR('Optional - input raw data'!H20/'Optional - input raw data'!H21,Calcs!$A$75)","v":""},null,{"$f":"IF(OR(L$14=\"\",L$15=\"\",L$16=\"\",L$17=\"\",J56=\"\"),\"\",\nIF(J56<=Calcs!M17,Inline,\nIF(AND(J56>Calcs!M17,J56<=Calcs!O17),Middle20,\nIF(AND(J56>Calcs!O17,J56<=Calcs!P17),Inline,\nIF(AND(J56>Calcs!P17,J56<=Calcs!Q17),Highest20,\nIF(J56>Calcs!Q17,Highest10,\"\"))))))","v":""},null,{"$f":"IFERROR('Optional - input raw data'!J20/'Optional - input raw data'!J21,Calcs!$A$75)","v":""},null,{"$f":"IF(OR(P$14=\"\",P$15=\"\",P$16=\"\",P$17=\"\",N56=\"\"),\"\",\nIF(N56<=Calcs!U17,Inline,\nIF(AND(N56>Calcs!U17,N56<=Calcs!W17),Middle20,\nIF(AND(N56>Calcs!W17,N56<=Calcs!X17),Inline,\nIF(AND(N56>Calcs!X17,N56<=Calcs!Y17),Highest20,\nIF(N56>Calcs!Y17,Highest10,\"\"))))))","v":""},null,{"$f":"IFERROR('Optional - input raw data'!L20/'Optional - input raw data'!L21,Calcs!$A$75)","v":""},null,{"$f":"IF(OR(T$14=\"\",T$15=\"\",T$16=\"\",T$17=\"\",R56=\"\"),\"\",\nIF(R56<=Calcs!AC17,Inline,\nIF(AND(R56>Calcs!AC17,R56<=Calcs!AE17),Middle20,\nIF(AND(R56>Calcs!AE17,R56<=Calcs!AF17),Inline,\nIF(AND(R56>Calcs!AF17,R56<=Calcs!AG17),Highest20,\nIF(R56>Calcs!AG17,Highest10,\"\"))))))","v":""},null,{"$f":"IFERROR('Optional - input raw data'!N20/'Optional - input raw data'!N21,\"\")","v":""},null,{"$f":"IF(OR(X$14=\"\",X$15=\"\",X$16=\"\",X$17=\"\",V56=\"\"),\"\",\nIF(V56<=Calcs!AK17,Inline,\nIF(AND(V56>Calcs!AK17,V56<=Calcs!AM17),Middle20,\nIF(AND(V56>Calcs!AM17,V56<=Calcs!AN17),Inline,\nIF(AND(V56>Calcs!AN17,V56<=Calcs!AO17),Highest20,\nIF(V56>Calcs!AO17,Highest10,\"\"))))))","v":""},null,{"$f":"IFERROR('Optional - input raw data'!P20/'Optional - input raw data'!P21,\"\")","v":""},null,{"$f":"IF(OR(AB$14=\"\",AB$15=\"\",AB$16=\"\",AB$17=\"\",Z56=\"\"),\"\",\nIF(Z56<=Calcs!AS17,Inline,\nIF(AND(Z56>Calcs!AS17,Z56<=Calcs!AU17),Middle20,\nIF(AND(Z56>Calcs!AU17,Z56<=Calcs!AV17),Inline,\nIF(AND(Z56>Calcs!AV17,Z56<=Calcs!AW17),Highest20,\nIF(Z56>Calcs!AW17,Highest10,\"\"))))))","v":""},null,{"$f":"IFERROR('Optional - input raw data'!R20/'Optional - input raw data'!R21,\"\")","v":""},null,{"$f":"IF(OR(AF$14=\"\",AF$15=\"\",AF$16=\"\",AF$17=\"\",AD56=\"\"),\"\",\nIF(AD56<=Calcs!BA17,Inline,\nIF(AND(AD56>Calcs!BA17,AD56<=Calcs!BC17),Middle20,\nIF(AND(AD56>Calcs!BC17,AD56<=Calcs!BD17),Inline,\nIF(AND(AD56>Calcs!BD17,AD56<=Calcs!BE17),Highest20,\nIF(AD56>Calcs!BE17,Highest10,\"\"))))))","v":""},null,{"$f":"IFERROR('Optional - input raw data'!T20/'Optional - input raw data'!T21,\"\")","v":""},null,{"$f":"IF(OR(AJ$14=\"\",AJ$15=\"\",AJ$16=\"\",AJ$17=\"\",AH56=\"\"),\"\",\nIF(AH56<=Calcs!BI17,Inline,\nIF(AND(AH56>Calcs!BI17,AH56<=Calcs!BK17),Middle20,\nIF(AND(AH56>Calcs!BK17,AH56<=Calcs!BL17),Inline,\nIF(AND(AH56>Calcs!BL17,AH56<=Calcs!BM17),Highest20,\nIF(AH56>Calcs!BM17,Highest10,\"\"))))))","v":""},null,{"$f":"IFERROR('Optional - input raw data'!V20/'Optional - input raw data'!V21,\"\")","v":""},null,{"$f":"IF(OR(AN$14=\"\",AN$15=\"\",AN$16=\"\",AN$17=\"\",AL56=\"\"),\"\",\nIF(AL56<=Calcs!BQ17,Inline,\nIF(AND(AL56>Calcs!BQ17,AL56<=Calcs!BS17),Middle20,\nIF(AND(AL56>Calcs!BS17,AL56<=Calcs!BT17),Inline,\nIF(AND(AL56>Calcs!BT17,AL56<=Calcs!BU17),Highest20,\nIF(AL56>Calcs!BU17,Highest10,\"\"))))))","v":""},null,{"$f":"IFERROR('Optional - input raw data'!X20/'Optional - input raw data'!X21,\"\")","v":""},null,{"$f":"IF(OR(AR$14=\"\",AR$15=\"\",AR$16=\"\",AR$17=\"\",AP56=\"\"),\"\",\nIF(AP56<=Calcs!BY17,Inline,\nIF(AND(AP56>Calcs!BY17,AP56<=Calcs!CA17),Middle20,\nIF(AND(AP56>Calcs!CA17,AP56<=Calcs!CB17),Inline,\nIF(AND(AP56>Calcs!CB17,AP56<=Calcs!CC17),Highest20,\nIF(AP56>Calcs!CC17,Highest10,\"\"))))))","v":""},null,{"$f":"IFERROR('Optional - input raw data'!Z20/'Optional - input raw data'!Z21,\"\")","v":""},null,{"$f":"IF(OR(AV$14=\"\",AV$15=\"\",AV$16=\"\",AV$17=\"\",AT56=\"\"),\"\",\nIF(AT56<=Calcs!CG17,Inline,\nIF(AND(AT56>Calcs!CG17,AT56<=Calcs!CI17),Middle20,\nIF(AND(AT56>Calcs!CI17,AT56<=Calcs!CJ17),Inline,\nIF(AND(AT56>Calcs!CJ17,AT56<=Calcs!CK17),Highest20,\nIF(AT56>Calcs!CK17,Highest10,\"\"))))))","v":""},null,{"$f":"IFERROR('Optional - input raw data'!AB20/'Optional - input raw data'!AB21,\"\")","v":""},null,{"$f":"IF(OR(AZ$14=\"\",AZ$15=\"\",AZ$16=\"\",AZ$17=\"\",AX56=\"\"),\"\",\nIF(AX56<=Calcs!CO17,Inline,\nIF(AND(AX56>Calcs!CO17,AX56<=Calcs!CQ17),Middle20,\nIF(AND(AX56>Calcs!CQ17,AX56<=Calcs!CR17),Inline,\nIF(AND(AX56>Calcs!CR17,AX56<=Calcs!CS17),Highest20,\nIF(AX56>Calcs!CS17,Highest10,\"\"))))))","v":""},null,{"$f":"IFERROR('Optional - input raw data'!AD20/'Optional - input raw data'!AD21,\"\")","v":""},null,{"$f":"IF(OR(BD$14=\"\",BD$15=\"\",BD$16=\"\",BD$17=\"\",BB56=\"\"),\"\",\nIF(BB56<=Calcs!CW17,Inline,\nIF(AND(BB56>Calcs!CW17,BB56<=Calcs!CY17),Middle20,\nIF(AND(BB56>Calcs!CY17,BB56<=Calcs!CZ17),Inline,\nIF(AND(BB56>Calcs!CZ17,BB56<=Calcs!DA17),Highest20,\nIF(BB56>Calcs!DA17,Highest10,\"\"))))))","v":""},null,{"$f":"IFERROR('Optional - input raw data'!AF20/'Optional - input raw data'!AF21,\"\")","v":""},null,{"$f":"IF(OR(BH$14=\"\",BH$15=\"\",BH$16=\"\",BH$17=\"\",BF56=\"\"),\"\",\nIF(BF56<=Calcs!DE17,Inline,\nIF(AND(BF56>Calcs!DE17,BF56<=Calcs!DG17),Middle20,\nIF(AND(BF56>Calcs!DG17,BF56<=Calcs!DH17),Inline,\nIF(AND(BF56>Calcs!DH17,BF56<=Calcs!DI17),Highest20,\nIF(BF56>Calcs!DI17,Highest10,\"\"))))))","v":""},null,{"$f":"IFERROR('Optional - input raw data'!AH20/'Optional - input raw data'!AH21,\"\")","v":""},null,{"$f":"IF(OR(BL$14=\"\",BL$15=\"\",BL$16=\"\",BL$17=\"\",BJ56=\"\"),\"\",\nIF(BJ56<=Calcs!DM17,Inline,\nIF(AND(BJ56>Calcs!DM17,BJ56<=Calcs!DO17),Middle20,\nIF(AND(BJ56>Calcs!DO17,BJ56<=Calcs!DP17),Inline,\nIF(AND(BJ56>Calcs!DP17,BJ56<=Calcs!DQ17),Highest20,\nIF(BJ56>Calcs!DQ17,Highest10,\"\"))))))","v":""},null,{"$f":"IFERROR('Optional - input raw data'!AJ20/'Optional - input raw data'!AJ21,\"\")","v":""},null,{"$f":"IF(OR(BP$14=\"\",BP$15=\"\",BP$16=\"\",BP$17=\"\",BN56=\"\"),\"\",\nIF(BN56<=Calcs!DU17,Inline,\nIF(AND(BN56>Calcs!DU17,BN56<=Calcs!DW17),Middle20,\nIF(AND(BN56>Calcs!DW17,BN56<=Calcs!DX17),Inline,\nIF(AND(BN56>Calcs!DX17,BN56<=Calcs!DY17),Highest20,\nIF(BN56>Calcs!DY17,Highest10,\"\"))))))","v":""},null,{"$f":"IFERROR('Optional - input raw data'!AL20/'Optional - input raw data'!AL21,\"\")","v":""},null,{"$f":"IF(OR(BT$14=\"\",BT$15=\"\",BT$16=\"\",BT$17=\"\",BR56=\"\"),\"\",\nIF(BR56<=Calcs!EC17,Inline,\nIF(AND(BR56>Calcs!EC17,BR56<=Calcs!EE17),Middle20,\nIF(AND(BR56>Calcs!EE17,BR56<=Calcs!EF17),Inline,\nIF(AND(BR56>Calcs!EF17,BR56<=Calcs!EG17),Highest20,\nIF(BR56>Calcs!EG17,Highest10,\"\"))))))","v":""},null,{"$f":"IFERROR('Optional - input raw data'!AN20/'Optional - input raw data'!AN21,\"\")","v":""},null,{"$f":"IF(OR(BX$14=\"\",BX$15=\"\",BX$16=\"\",BX$17=\"\",BV56=\"\"),\"\",\nIF(BV56<=Calcs!EK17,Inline,\nIF(AND(BV56>Calcs!EK17,BV56<=Calcs!EM17),Middle20,\nIF(AND(BV56>Calcs!EM17,BV56<=Calcs!EN17),Inline,\nIF(AND(BV56>Calcs!EN17,BV56<=Calcs!EO17),Highest20,\nIF(BV56>Calcs!EO17,Highest10,\"\"))))))","v":""},null,{"$f":"IFERROR('Optional - input raw data'!AP20/'Optional - input raw data'!AP21,\"\")","v":""},null,{"$f":"IF(OR(CB$14=\"\",CB$15=\"\",CB$16=\"\",CB$17=\"\",BZ56=\"\"),\"\",\nIF(BZ56<=Calcs!ES17,Inline,\nIF(AND(BZ56>Calcs!ES17,BZ56<=Calcs!EU17),Middle20,\nIF(AND(BZ56>Calcs!EU17,BZ56<=Calcs!EV17),Inline,\nIF(AND(BZ56>Calcs!EV17,BZ56<=Calcs!EW17),Highest20,\nIF(BZ56>Calcs!EW17,Highest10,\"\"))))))","v":""},null,{"$f":"IFERROR('Optional - input raw data'!AR20/'Optional - input raw data'!AR21,Calcs!$A$75)","v":""},null,{"$f":"IF(OR(CF$14=\"\",CF$15=\"\",CF$16=\"\",CF$17=\"\",CD56=\"\"),\"\",\nIF(CD56<=Calcs!FA17,Inline,\nIF(AND(CD56>Calcs!FA17,CD56<=Calcs!FC17),Middle20,\nIF(AND(CD56>Calcs!FC17,CD56<=Calcs!FD17),Inline,\nIF(AND(CD56>Calcs!FD17,CD56<=Calcs!FE17),Highest20,\nIF(CD56>Calcs!FE17,Highest10,\"\"))))))","v":""}]
[null,null,"Pupil to teacher ratio","Guidance",null,{"$f":"IFERROR(H16/'Optional - input raw data'!F19,Calcs!$A$75)","v":{"v":18.464900300464354,"d":"18.5"}},null,{"$f":"IF(OR(H$14=\"\",H$15=\"\",H$16=\"\",H$17=\"\",F57=\"\"),\"\",\nIF(F57<=Calcs!C18,Lowest10,\nIF(AND(F57>Calcs!C18,F57<=Calcs!D18),Lowest20,\nIF(AND(F57>Calcs!D18,F57<=Calcs!E18),Inline,\nIF(AND(F57>Calcs!E18,F57<=Calcs!G18),Middle20,\nIF(AND(F57>Calcs!G18,F57<=Calcs!H18),Inline,\nIF(AND(F57>Calcs!H18,F57<=Calcs!I18),Highest20,\nIF(F57>Calcs!I18,Highest10,\"\"))))))))","v":"Highest 20% of similar schools"},null,{"$f":"IFERROR(L16/'Optional - input raw data'!H19,Calcs!$A$75)","v":""},null,{"$f":"IF(OR(L$14=\"\",L$15=\"\",L$16=\"\",L$17=\"\",J57=\"\"),\"\",\nIF(J57<=Calcs!K18,Lowest10,\nIF(AND(J57>Calcs!K18,J57<=Calcs!L18),Lowest20,\nIF(AND(J57>Calcs!L18,J57<=Calcs!M18),Inline,\nIF(AND(J57>Calcs!M18,J57<=Calcs!O18),Middle20,\nIF(AND(J57>Calcs!O18,J57<=Calcs!P18),Inline,\nIF(AND(J57>Calcs!P18,J57<=Calcs!Q18),Highest20,\nIF(J57>Calcs!Q18,Highest10,\"\"))))))))","v":""},null,{"$f":"IFERROR(P16/'Optional - input raw data'!J19,Calcs!$A$75)","v":""},null,{"$f":"IF(OR(P$14=\"\",P$15=\"\",P$16=\"\",P$17=\"\",N57=\"\"),\"\",\nIF(N57<=Calcs!S18,Lowest10,\nIF(AND(N57>Calcs!S18,N57<=Calcs!T18),Lowest20,\nIF(AND(N57>Calcs!T18,N57<=Calcs!U18),Inline,\nIF(AND(N57>Calcs!U18,N57<=Calcs!W18),Middle20,\nIF(AND(N57>Calcs!W18,N57<=Calcs!X18),Inline,\nIF(AND(N57>Calcs!X18,N57<=Calcs!Y18),Highest20,\nIF(N57>Calcs!Y18,Highest10,\"\"))))))))","v":""},null,{"$f":"IFERROR(T16/'Optional - input raw data'!L19,Calcs!$A$75)","v":""},null,{"$f":"IF(OR(T$14=\"\",T$15=\"\",T$16=\"\",T$17=\"\",R57=\"\"),\"\",\nIF(R57<=Calcs!AA18,Lowest10,\nIF(AND(R57>Calcs!AA18,R57<=Calcs!AB18),Lowest20,\nIF(AND(R57>Calcs!AB18,R57<=Calcs!AC18),Inline,\nIF(AND(R57>Calcs!AC18,R57<=Calcs!AE18),Middle20,\nIF(AND(R57>Calcs!AE18,R57<=Calcs!AF18),Inline,\nIF(AND(R57>Calcs!AF18,R57<=Calcs!AG18),Highest20,\nIF(R57>Calcs!AG18,Highest10,\"\"))))))))","v":""},null,{"$f":"IFERROR(X16/'Optional - input raw data'!N19,\"\")","v":""},null,{"$f":"IF(OR(X$14=\"\",X$15=\"\",X$16=\"\",X$17=\"\",V57=\"\"),\"\",\nIF(V57<=Calcs!AI18,Lowest10,\nIF(AND(V57>Calcs!AI18,V57<=Calcs!AJ18),Lowest20,\nIF(AND(V57>Calcs!AJ18,V57<=Calcs!AK18),Inline,\nIF(AND(V57>Calcs!AK18,V57<=Calcs!AM18),Middle20,\nIF(AND(V57>Calcs!AM18,V57<=Calcs!AN18),Inline,\nIF(AND(V57>Calcs!AN18,V57<=Calcs!AO18),Highest20,\nIF(V57>Calcs!AO18,Highest10,\"\"))))))))","v":""},null,{"$f":"IFERROR(AB16/'Optional - input raw data'!P19,\"\")","v":""},null,{"$f":"IF(OR(AB$14=\"\",AB$15=\"\",AB$16=\"\",AB$17=\"\",Z57=\"\"),\"\",\nIF(Z57<=Calcs!AQ18,Lowest10,\nIF(AND(Z57>Calcs!AQ18,Z57<=Calcs!AR18),Lowest20,\nIF(AND(Z57>Calcs!AR18,Z57<=Calcs!AS18),Inline,\nIF(AND(Z57>Calcs!AS18,Z57<=Calcs!AU18),Middle20,\nIF(AND(Z57>Calcs!AU18,Z57<=Calcs!AV18),Inline,\nIF(AND(Z57>Calcs!AV18,Z57<=Calcs!AW18),Highest20,\nIF(Z57>Calcs!AW18,Highest10,\"\"))))))))","v":""},null,{"$f":"IFERROR(AF16/'Optional - input raw data'!R19,\"\")","v":""},null,{"$f":"IF(OR(AF$14=\"\",AF$15=\"\",AF$16=\"\",AF$17=\"\",AD57=\"\"),\"\",\nIF(AD57<=Calcs!AY18,Lowest10,\nIF(AND(AD57>Calcs!AY18,AD57<=Calcs!AZ18),Lowest20,\nIF(AND(AD57>Calcs!AZ18,AD57<=Calcs!BA18),Inline,\nIF(AND(AD57>Calcs!BA18,AD57<=Calcs!BC18),Middle20,\nIF(AND(AD57>Calcs!BC18,AD57<=Calcs!BD18),Inline,\nIF(AND(AD57>Calcs!BD18,AD57<=Calcs!BE18),Highest20,\nIF(AD57>Calcs!BE18,Highest10,\"\"))))))))","v":""},null,{"$f":"IFERROR(AJ16/'Optional - input raw data'!T19,\"\")","v":""},null,{"$f":"IF(OR(AJ$14=\"\",AJ$15=\"\",AJ$16=\"\",AJ$17=\"\",AH57=\"\"),\"\",\nIF(AH57<=Calcs!BG18,Lowest10,\nIF(AND(AH57>Calcs!BG18,AH57<=Calcs!BH18),Lowest20,\nIF(AND(AH57>Calcs!BH18,AH57<=Calcs!BI18),Inline,\nIF(AND(AH57>Calcs!BI18,AH57<=Calcs!BK18),Middle20,\nIF(AND(AH57>Calcs!BK18,AH57<=Calcs!BL18),Inline,\nIF(AND(AH57>Calcs!BL18,AH57<=Calcs!BM18),Highest20,\nIF(AH57>Calcs!BM18,Highest10,\"\"))))))))","v":""},null,{"$f":"IFERROR(AN16/'Optional - input raw data'!V19,\"\")","v":""},null,{"$f":"IF(OR(AN$14=\"\",AN$15=\"\",AN$16=\"\",AN$17=\"\",AL57=\"\"),\"\",\nIF(AL57<=Calcs!BO18,Lowest10,\nIF(AND(AL57>Calcs!BO18,AL57<=Calcs!BP18),Lowest20,\nIF(AND(AL57>Calcs!BP18,AL57<=Calcs!BQ18),Inline,\nIF(AND(AL57>Calcs!BQ18,AL57<=Calcs!BS18),Middle20,\nIF(AND(AL57>Calcs!BS18,AL57<=Calcs!BT18),Inline,\nIF(AND(AL57>Calcs!BT18,AL57<=Calcs!BU18),Highest20,\nIF(AL57>Calcs!BU18,Highest10,\"\"))))))))","v":""},null,{"$f":"IFERROR(AR16/'Optional - input raw data'!X19,\"\")","v":""},null,{"$f":"IF(OR(AR$14=\"\",AR$15=\"\",AR$16=\"\",AR$17=\"\",AP57=\"\"),\"\",\nIF(AP57<=Calcs!BW18,Lowest10,\nIF(AND(AP57>Calcs!BW18,AP57<=Calcs!BX18),Lowest20,\nIF(AND(AP57>Calcs!BX18,AP57<=Calcs!BY18),Inline,\nIF(AND(AP57>Calcs!BY18,AP57<=Calcs!CA18),Middle20,\nIF(AND(AP57>Calcs!CA18,AP57<=Calcs!CB18),Inline,\nIF(AND(AP57>Calcs!CB18,AP57<=Calcs!CC18),Highest20,\nIF(AP57>Calcs!CC18,Highest10,\"\"))))))))","v":""},null,{"$f":"IFERROR(AV16/'Optional - input raw data'!Z19,\"\")","v":""},null,{"$f":"IF(OR(AV$14=\"\",AV$15=\"\",AV$16=\"\",AV$17=\"\",AT57=\"\"),\"\",\nIF(AT57<=Calcs!CE18,Lowest10,\nIF(AND(AT57>Calcs!CE18,AT57<=Calcs!CF18),Lowest20,\nIF(AND(AT57>Calcs!CF18,AT57<=Calcs!CG18),Inline,\nIF(AND(AT57>Calcs!CG18,AT57<=Calcs!CI18),Middle20,\nIF(AND(AT57>Calcs!CI18,AT57<=Calcs!CJ18),Inline,\nIF(AND(AT57>Calcs!CJ18,AT57<=Calcs!CK18),Highest20,\nIF(AT57>Calcs!CK18,Highest10,\"\"))))))))","v":""},null,{"$f":"IFERROR(AZ16/'Optional - input raw data'!AB19,\"\")","v":""},null,{"$f":"IF(OR(AZ$14=\"\",AZ$15=\"\",AZ$16=\"\",AZ$17=\"\",AX57=\"\"),\"\",\nIF(AX57<=Calcs!CM18,Lowest10,\nIF(AND(AX57>Calcs!CM18,AX57<=Calcs!CN18),Lowest20,\nIF(AND(AX57>Calcs!CN18,AX57<=Calcs!CO18),Inline,\nIF(AND(AX57>Calcs!CO18,AX57<=Calcs!CQ18),Middle20,\nIF(AND(AX57>Calcs!CQ18,AX57<=Calcs!CR18),Inline,\nIF(AND(AX57>Calcs!CR18,AX57<=Calcs!CS18),Highest20,\nIF(AX57>Calcs!CS18,Highest10,\"\"))))))))","v":""},null,{"$f":"IFERROR(BD16/'Optional - input raw data'!AD19,\"\")","v":""},null,{"$f":"IF(OR(BD$14=\"\",BD$15=\"\",BD$16=\"\",BD$17=\"\",BB57=\"\"),\"\",\nIF(BB57<=Calcs!CU18,Lowest10,\nIF(AND(BB57>Calcs!CU18,BB57<=Calcs!CV18),Lowest20,\nIF(AND(BB57>Calcs!CV18,BB57<=Calcs!CW18),Inline,\nIF(AND(BB57>Calcs!CW18,BB57<=Calcs!CY18),Middle20,\nIF(AND(BB57>Calcs!CY18,BB57<=Calcs!CZ18),Inline,\nIF(AND(BB57>Calcs!CZ18,BB57<=Calcs!DA18),Highest20,\nIF(BB57>Calcs!DA18,Highest10,\"\"))))))))","v":""},null,{"$f":"IFERROR(BH16/'Optional - input raw data'!AF19,\"\")","v":""},null,{"$f":"IF(OR(BH$14=\"\",BH$15=\"\",BH$16=\"\",BH$17=\"\",BF57=\"\"),\"\",\nIF(BF57<=Calcs!DC18,Lowest10,\nIF(AND(BF57>Calcs!DC18,BF57<=Calcs!DD18),Lowest20,\nIF(AND(BF57>Calcs!DD18,BF57<=Calcs!DE18),Inline,\nIF(AND(BF57>Calcs!DE18,BF57<=Calcs!DG18),Middle20,\nIF(AND(BF57>Calcs!DG18,BF57<=Calcs!DH18),Inline,\nIF(AND(BF57>Calcs!DH18,BF57<=Calcs!DI18),Highest20,\nIF(BF57>Calcs!DI18,Highest10,\"\"))))))))","v":""},null,{"$f":"IFERROR(BL16/'Optional - input raw data'!AH19,\"\")","v":""},null,{"$f":"IF(OR(BL$14=\"\",BL$15=\"\",BL$16=\"\",BL$17=\"\",BJ57=\"\"),\"\",\nIF(BJ57<=Calcs!DK18,Lowest10,\nIF(AND(BJ57>Calcs!DK18,BJ57<=Calcs!DL18),Lowest20,\nIF(AND(BJ57>Calcs!DL18,BJ57<=Calcs!DM18),Inline,\nIF(AND(BJ57>Calcs!DM18,BJ57<=Calcs!DO18),Middle20,\nIF(AND(BJ57>Calcs!DO18,BJ57<=Calcs!DP18),Inline,\nIF(AND(BJ57>Calcs!DP18,BJ57<=Calcs!DQ18),Highest20,\nIF(BJ57>Calcs!DQ18,Highest10,\"\"))))))))","v":""},null,{"$f":"IFERROR(BP16/'Optional - input raw data'!AJ19,\"\")","v":""},null,{"$f":"IF(OR(BP$14=\"\",BP$15=\"\",BP$16=\"\",BP$17=\"\",BN57=\"\"),\"\",\nIF(BN57<=Calcs!DS18,Lowest10,\nIF(AND(BN57>Calcs!DS18,BN57<=Calcs!DT18),Lowest20,\nIF(AND(BN57>Calcs!DT18,BN57<=Calcs!DU18),Inline,\nIF(AND(BN57>Calcs!DU18,BN57<=Calcs!DW18),Middle20,\nIF(AND(BN57>Calcs!DW18,BN57<=Calcs!DX18),Inline,\nIF(AND(BN57>Calcs!DX18,BN57<=Calcs!DY18),Highest20,\nIF(BN57>Calcs!DY18,Highest10,\"\"))))))))","v":""},null,{"$f":"IFERROR(BT16/'Optional - input raw data'!AL19,\"\")","v":""},null,{"$f":"IF(OR(BT$14=\"\",BT$15=\"\",BT$16=\"\",BT$17=\"\",BR57=\"\"),\"\",\nIF(BR57<=Calcs!EA18,Lowest10,\nIF(AND(BR57>Calcs!EA18,BR57<=Calcs!EB18),Lowest20,\nIF(AND(BR57>Calcs!EB18,BR57<=Calcs!EC18),Inline,\nIF(AND(BR57>Calcs!EC18,BR57<=Calcs!EE18),Middle20,\nIF(AND(BR57>Calcs!EE18,BR57<=Calcs!EF18),Inline,\nIF(AND(BR57>Calcs!EF18,BR57<=Calcs!EG18),Highest20,\nIF(BR57>Calcs!EG18,Highest10,\"\"))))))))","v":""},null,{"$f":"IFERROR(BX16/'Optional - input raw data'!AN19,\"\")","v":""},null,{"$f":"IF(OR(BX$14=\"\",BX$15=\"\",BX$16=\"\",BX$17=\"\",BV57=\"\"),\"\",\nIF(BV57<=Calcs!EI18,Lowest10,\nIF(AND(BV57>Calcs!EI18,BV57<=Calcs!EJ18),Lowest20,\nIF(AND(BV57>Calcs!EJ18,BV57<=Calcs!EK18),Inline,\nIF(AND(BV57>Calcs!EK18,BV57<=Calcs!EM18),Middle20,\nIF(AND(BV57>Calcs!EM18,BV57<=Calcs!EN18),Inline,\nIF(AND(BV57>Calcs!EN18,BV57<=Calcs!EO18),Highest20,\nIF(BV57>Calcs!EO18,Highest10,\"\"))))))))","v":""},null,{"$f":"IFERROR(CB16/'Optional - input raw data'!AP19,\"\")","v":""},null,{"$f":"IF(OR(CB$14=\"\",CB$15=\"\",CB$16=\"\",CB$17=\"\",BZ57=\"\"),\"\",\nIF(BZ57<=Calcs!EQ18,Lowest10,\nIF(AND(BZ57>Calcs!EQ18,BZ57<=Calcs!ER18),Lowest20,\nIF(AND(BZ57>Calcs!ER18,BZ57<=Calcs!ES18),Inline,\nIF(AND(BZ57>Calcs!ES18,BZ57<=Calcs!EU18),Middle20,\nIF(AND(BZ57>Calcs!EU18,BZ57<=Calcs!EV18),Inline,\nIF(AND(BZ57>Calcs!EV18,BZ57<=Calcs!EW18),Highest20,\nIF(BZ57>Calcs!EW18,Highest10,\"\"))))))))","v":""},null,{"$f":"IFERROR(CF16/'Optional - input raw data'!AR19,Calcs!$A$75)","v":""},null,{"$f":"IF(OR(CF$14=\"\",CF$15=\"\",CF$16=\"\",CF$17=\"\",CD57=\"\"),\"\",\nIF(CD57<=Calcs!EY18,Lowest10,\nIF(AND(CD57>Calcs!EY18,CD57<=Calcs!EZ18),Lowest20,\nIF(AND(CD57>Calcs!EZ18,CD57<=Calcs!FA18),Inline,\nIF(AND(CD57>Calcs!FA18,CD57<=Calcs!FC18),Middle20,\nIF(AND(CD57>Calcs!FC18,CD57<=Calcs!FD18),Inline,\nIF(AND(CD57>Calcs!FD18,CD57<=Calcs!FE18),Highest20,\nIF(CD57>Calcs!FE18,Highest10,\"\"))))))))","v":""}]
[null,null,"Pupil to adult ratio","Guidance",null,{"$f":"IFERROR(H16/'Optional - input raw data'!F21,Calcs!$A$75)","v":{"v":10.714851799017277,"d":"10.7"}},null,{"$f":"IF(OR(H$14=\"\",H$15=\"\",H$16=\"\",H$17=\"\",F58=\"\"),\"\",\nIF(F58<=Calcs!C19,Lowest10,\nIF(AND(F58>Calcs!C19,F58<=Calcs!D19),Lowest20,\nIF(AND(F58>Calcs!D19,F58<=Calcs!E19),Inline,\nIF(AND(F58>Calcs!E19,F58<=Calcs!G19),Middle20,\nIF(AND(F58>Calcs!G19,F58<=Calcs!H19),Inline,\nIF(AND(F58>Calcs!H19,F58<=Calcs!I19),Highest20,\nIF(F58>Calcs!I19,Highest10,\"\"))))))))","v":"Broadly in line with similar schools"},null,{"$f":"IFERROR(L16/'Optional - input raw data'!H21,Calcs!$A$75)","v":""},null,{"$f":"IF(OR(L$14=\"\",L$15=\"\",L$16=\"\",L$17=\"\",J58=\"\"),\"\",\nIF(J58<=Calcs!K19,Lowest10,\nIF(AND(J58>Calcs!K19,J58<=Calcs!L19),Lowest20,\nIF(AND(J58>Calcs!L19,J58<=Calcs!M19),Inline,\nIF(AND(J58>Calcs!M19,J58<=Calcs!O19),Middle20,\nIF(AND(J58>Calcs!O19,J58<=Calcs!P19),Inline,\nIF(AND(J58>Calcs!P19,J58<=Calcs!Q19),Highest20,\nIF(J58>Calcs!Q19,Highest10,\"\"))))))))","v":""},null,{"$f":"IFERROR(P16/'Optional - input raw data'!J21,Calcs!$A$75)","v":""},null,{"$f":"IF(OR(P$14=\"\",P$15=\"\",P$16=\"\",P$17=\"\",N58=\"\"),\"\",\nIF(N58<=Calcs!S19,Lowest10,\nIF(AND(N58>Calcs!S19,N58<=Calcs!T19),Lowest20,\nIF(AND(N58>Calcs!T19,N58<=Calcs!U19),Inline,\nIF(AND(N58>Calcs!U19,N58<=Calcs!W19),Middle20,\nIF(AND(N58>Calcs!W19,N58<=Calcs!X19),Inline,\nIF(AND(N58>Calcs!X19,N58<=Calcs!Y19),Highest20,\nIF(N58>Calcs!Y19,Highest10,\"\"))))))))","v":""},null,{"$f":"IFERROR(T16/'Optional - input raw data'!L21,Calcs!$A$75)","v":""},null,{"$f":"IF(OR(T$14=\"\",T$15=\"\",T$16=\"\",T$17=\"\",R58=\"\"),\"\",\nIF(R58<=Calcs!AA19,Lowest10,\nIF(AND(R58>Calcs!AA19,R58<=Calcs!AB19),Lowest20,\nIF(AND(R58>Calcs!AB19,R58<=Calcs!AC19),Inline,\nIF(AND(R58>Calcs!AC19,R58<=Calcs!AE19),Middle20,\nIF(AND(R58>Calcs!AE19,R58<=Calcs!AF19),Inline,\nIF(AND(R58>Calcs!AF19,R58<=Calcs!AG19),Highest20,\nIF(R58>Calcs!AG19,Highest10,\"\"))))))))","v":""},null,{"$f":"IFERROR(X16/'Optional - input raw data'!N21,\"\")","v":""},null,{"$f":"IF(OR(X$14=\"\",X$15=\"\",X$16=\"\",X$17=\"\",V58=\"\"),\"\",\nIF(V58<=Calcs!AI19,Lowest10,\nIF(AND(V58>Calcs!AI19,V58<=Calcs!AJ19),Lowest20,\nIF(AND(V58>Calcs!AJ19,V58<=Calcs!AK19),Inline,\nIF(AND(V58>Calcs!AK19,V58<=Calcs!AM19),Middle20,\nIF(AND(V58>Calcs!AM19,V58<=Calcs!AN19),Inline,\nIF(AND(V58>Calcs!AN19,V58<=Calcs!AO19),Highest20,\nIF(V58>Calcs!AO19,Highest10,\"\"))))))))","v":""},null,{"$f":"IFERROR(AB16/'Optional - input raw data'!P21,\"\")","v":""},null,{"$f":"IF(OR(AB$14=\"\",AB$15=\"\",AB$16=\"\",AB$17=\"\",Z58=\"\"),\"\",\nIF(Z58<=Calcs!AQ19,Lowest10,\nIF(AND(Z58>Calcs!AQ19,Z58<=Calcs!AR19),Lowest20,\nIF(AND(Z58>Calcs!AR19,Z58<=Calcs!AS19),Inline,\nIF(AND(Z58>Calcs!AS19,Z58<=Calcs!AU19),Middle20,\nIF(AND(Z58>Calcs!AU19,Z58<=Calcs!AV19),Inline,\nIF(AND(Z58>Calcs!AV19,Z58<=Calcs!AW19),Highest20,\nIF(Z58>Calcs!AW19,Highest10,\"\"))))))))","v":""},null,{"$f":"IFERROR(AF16/'Optional - input raw data'!R21,\"\")","v":""},null,{"$f":"IF(OR(AF$14=\"\",AF$15=\"\",AF$16=\"\",AF$17=\"\",AD58=\"\"),\"\",\nIF(AD58<=Calcs!AY19,Lowest10,\nIF(AND(AD58>Calcs!AY19,AD58<=Calcs!AZ19),Lowest20,\nIF(AND(AD58>Calcs!AZ19,AD58<=Calcs!BA19),Inline,\nIF(AND(AD58>Calcs!BA19,AD58<=Calcs!BC19),Middle20,\nIF(AND(AD58>Calcs!BC19,AD58<=Calcs!BD19),Inline,\nIF(AND(AD58>Calcs!BD19,AD58<=Calcs!BE19),Highest20,\nIF(AD58>Calcs!BE19,Highest10,\"\"))))))))","v":""},null,{"$f":"IFERROR(AJ16/'Optional - input raw data'!T21,\"\")","v":""},null,{"$f":"IF(OR(AJ$14=\"\",AJ$15=\"\",AJ$16=\"\",AJ$17=\"\",AH58=\"\"),\"\",\nIF(AH58<=Calcs!BG19,Lowest10,\nIF(AND(AH58>Calcs!BG19,AH58<=Calcs!BH19),Lowest20,\nIF(AND(AH58>Calcs!BH19,AH58<=Calcs!BI19),Inline,\nIF(AND(AH58>Calcs!BI19,AH58<=Calcs!BK19),Middle20,\nIF(AND(AH58>Calcs!BK19,AH58<=Calcs!BL19),Inline,\nIF(AND(AH58>Calcs!BL19,AH58<=Calcs!BM19),Highest20,\nIF(AH58>Calcs!BM19,Highest10,\"\"))))))))","v":""},null,{"$f":"IFERROR(AN16/'Optional - input raw data'!V21,\"\")","v":""},null,{"$f":"IF(OR(AN$14=\"\",AN$15=\"\",AN$16=\"\",AN$17=\"\",AL58=\"\"),\"\",\nIF(AL58<=Calcs!BO19,Lowest10,\nIF(AND(AL58>Calcs!BO19,AL58<=Calcs!BP19),Lowest20,\nIF(AND(AL58>Calcs!BP19,AL58<=Calcs!BQ19),Inline,\nIF(AND(AL58>Calcs!BQ19,AL58<=Calcs!BS19),Middle20,\nIF(AND(AL58>Calcs!BS19,AL58<=Calcs!BT19),Inline,\nIF(AND(AL58>Calcs!BT19,AL58<=Calcs!BU19),Highest20,\nIF(AL58>Calcs!BU19,Highest10,\"\"))))))))","v":""},null,{"$f":"IFERROR(AR16/'Optional - input raw data'!X21,\"\")","v":""},null,{"$f":"IF(OR(AR$14=\"\",AR$15=\"\",AR$16=\"\",AR$17=\"\",AP58=\"\"),\"\",\nIF(AP58<=Calcs!BW19,Lowest10,\nIF(AND(AP58>Calcs!BW19,AP58<=Calcs!BX19),Lowest20,\nIF(AND(AP58>Calcs!BX19,AP58<=Calcs!BY19),Inline,\nIF(AND(AP58>Calcs!BY19,AP58<=Calcs!CA19),Middle20,\nIF(AND(AP58>Calcs!CA19,AP58<=Calcs!CB19),Inline,\nIF(AND(AP58>Calcs!CB19,AP58<=Calcs!CC19),Highest20,\nIF(AP58>Calcs!CC19,Highest10,\"\"))))))))","v":""},null,{"$f":"IFERROR(AV16/'Optional - input raw data'!Z21,\"\")","v":""},null,{"$f":"IF(OR(AV$14=\"\",AV$15=\"\",AV$16=\"\",AV$17=\"\",AT58=\"\"),\"\",\nIF(AT58<=Calcs!CE19,Lowest10,\nIF(AND(AT58>Calcs!CE19,AT58<=Calcs!CF19),Lowest20,\nIF(AND(AT58>Calcs!CF19,AT58<=Calcs!CG19),Inline,\nIF(AND(AT58>Calcs!CG19,AT58<=Calcs!CI19),Middle20,\nIF(AND(AT58>Calcs!CI19,AT58<=Calcs!CJ19),Inline,\nIF(AND(AT58>Calcs!CJ19,AT58<=Calcs!CK19),Highest20,\nIF(AT58>Calcs!CK19,Highest10,\"\"))))))))","v":""},null,{"$f":"IFERROR(AZ16/'Optional - input raw data'!AB21,\"\")","v":""},null,{"$f":"IF(OR(AZ$14=\"\",AZ$15=\"\",AZ$16=\"\",AZ$17=\"\",AX58=\"\"),\"\",\nIF(AX58<=Calcs!CM19,Lowest10,\nIF(AND(AX58>Calcs!CM19,AX58<=Calcs!CN19),Lowest20,\nIF(AND(AX58>Calcs!CN19,AX58<=Calcs!CO19),Inline,\nIF(AND(AX58>Calcs!CO19,AX58<=Calcs!CQ19),Middle20,\nIF(AND(AX58>Calcs!CQ19,AX58<=Calcs!CR19),Inline,\nIF(AND(AX58>Calcs!CR19,AX58<=Calcs!CS19),Highest20,\nIF(AX58>Calcs!CS19,Highest10,\"\"))))))))","v":""},null,{"$f":"IFERROR(BD16/'Optional - input raw data'!AD21,\"\")","v":""},null,{"$f":"IF(OR(BD$14=\"\",BD$15=\"\",BD$16=\"\",BD$17=\"\",BB58=\"\"),\"\",\nIF(BB58<=Calcs!CU19,Lowest10,\nIF(AND(BB58>Calcs!CU19,BB58<=Calcs!CV19),Lowest20,\nIF(AND(BB58>Calcs!CV19,BB58<=Calcs!CW19),Inline,\nIF(AND(BB58>Calcs!CW19,BB58<=Calcs!CY19),Middle20,\nIF(AND(BB58>Calcs!CY19,BB58<=Calcs!CZ19),Inline,\nIF(AND(BB58>Calcs!CZ19,BB58<=Calcs!DA19),Highest20,\nIF(BB58>Calcs!DA19,Highest10,\"\"))))))))","v":""},null,{"$f":"IFERROR(BH16/'Optional - input raw data'!AF21,\"\")","v":""},null,{"$f":"IF(OR(BH$14=\"\",BH$15=\"\",BH$16=\"\",BH$17=\"\",BF58=\"\"),\"\",\nIF(BF58<=Calcs!DC19,Lowest10,\nIF(AND(BF58>Calcs!DC19,BF58<=Calcs!DD19),Lowest20,\nIF(AND(BF58>Calcs!DD19,BF58<=Calcs!DE19),Inline,\nIF(AND(BF58>Calcs!DE19,BF58<=Calcs!DG19),Middle20,\nIF(AND(BF58>Calcs!DG19,BF58<=Calcs!DH19),Inline,\nIF(AND(BF58>Calcs!DH19,BF58<=Calcs!DI19),Highest20,\nIF(BF58>Calcs!DI19,Highest10,\"\"))))))))","v":""},null,{"$f":"IFERROR(BL16/'Optional - input raw data'!AH21,\"\")","v":""},null,{"$f":"IF(OR(BL$14=\"\",BL$15=\"\",BL$16=\"\",BL$17=\"\",BJ58=\"\"),\"\",\nIF(BJ58<=Calcs!DK19,Lowest10,\nIF(AND(BJ58>Calcs!DK19,BJ58<=Calcs!DL19),Lowest20,\nIF(AND(BJ58>Calcs!DL19,BJ58<=Calcs!DM19),Inline,\nIF(AND(BJ58>Calcs!DM19,BJ58<=Calcs!DO19),Middle20,\nIF(AND(BJ58>Calcs!DO19,BJ58<=Calcs!DP19),Inline,\nIF(AND(BJ58>Calcs!DP19,BJ58<=Calcs!DQ19),Highest20,\nIF(BJ58>Calcs!DQ19,Highest10,\"\"))))))))","v":""},null,{"$f":"IFERROR(BP16/'Optional - input raw data'!AJ21,\"\")","v":""},null,{"$f":"IF(OR(BP$14=\"\",BP$15=\"\",BP$16=\"\",BP$17=\"\",BN58=\"\"),\"\",\nIF(BN58<=Calcs!DS19,Lowest10,\nIF(AND(BN58>Calcs!DS19,BN58<=Calcs!DT19),Lowest20,\nIF(AND(BN58>Calcs!DT19,BN58<=Calcs!DU19),Inline,\nIF(AND(BN58>Calcs!DU19,BN58<=Calcs!DW19),Middle20,\nIF(AND(BN58>Calcs!DW19,BN58<=Calcs!DX19),Inline,\nIF(AND(BN58>Calcs!DX19,BN58<=Calcs!DY19),Highest20,\nIF(BN58>Calcs!DY19,Highest10,\"\"))))))))","v":""},null,{"$f":"IFERROR(BT16/'Optional - input raw data'!AL21,\"\")","v":""},null,{"$f":"IF(OR(BT$14=\"\",BT$15=\"\",BT$16=\"\",BT$17=\"\",BR58=\"\"),\"\",\nIF(BR58<=Calcs!EA19,Lowest10,\nIF(AND(BR58>Calcs!EA19,BR58<=Calcs!EB19),Lowest20,\nIF(AND(BR58>Calcs!EB19,BR58<=Calcs!EC19),Inline,\nIF(AND(BR58>Calcs!EC19,BR58<=Calcs!EE19),Middle20,\nIF(AND(BR58>Calcs!EE19,BR58<=Calcs!EF19),Inline,\nIF(AND(BR58>Calcs!EF19,BR58<=Calcs!EG19),Highest20,\nIF(BR58>Calcs!EG19,Highest10,\"\"))))))))","v":""},null,{"$f":"IFERROR(BX16/'Optional - input raw data'!AN21,\"\")","v":""},null,{"$f":"IF(OR(BX$14=\"\",BX$15=\"\",BX$16=\"\",BX$17=\"\",BV58=\"\"),\"\",\nIF(BV58<=Calcs!EI19,Lowest10,\nIF(AND(BV58>Calcs!EI19,BV58<=Calcs!EJ19),Lowest20,\nIF(AND(BV58>Calcs!EJ19,BV58<=Calcs!EK19),Inline,\nIF(AND(BV58>Calcs!EK19,BV58<=Calcs!EM19),Middle20,\nIF(AND(BV58>Calcs!EM19,BV58<=Calcs!EN19),Inline,\nIF(AND(BV58>Calcs!EN19,BV58<=Calcs!EO19),Highest20,\nIF(BV58>Calcs!EO19,Highest10,\"\"))))))))","v":""},null,{"$f":"IFERROR(CB16/'Optional - input raw data'!AP21,\"\")","v":""},null,{"$f":"IF(OR(CB$14=\"\",CB$15=\"\",CB$16=\"\",CB$17=\"\",BZ58=\"\"),\"\",\nIF(BZ58<=Calcs!EQ19,Lowest10,\nIF(AND(BZ58>Calcs!EQ19,BZ58<=Calcs!ER19),Lowest20,\nIF(AND(BZ58>Calcs!ER19,BZ58<=Calcs!ES19),Inline,\nIF(AND(BZ58>Calcs!ES19,BZ58<=Calcs!EU19),Middle20,\nIF(AND(BZ58>Calcs!EU19,BZ58<=Calcs!EV19),Inline,\nIF(AND(BZ58>Calcs!EV19,BZ58<=Calcs!EW19),Highest20,\nIF(BZ58>Calcs!EW19,Highest10,\"\"))))))))","v":""},null,{"$f":"IFERROR(CF16/'Optional - input raw data'!AR21,Calcs!$A$75)","v":""},null,{"$f":"IF(OR(CF$14=\"\",CF$15=\"\",CF$16=\"\",CF$17=\"\",CD58=\"\"),\"\",\nIF(CD58<=Calcs!EY19,Lowest10,\nIF(AND(CD58>Calcs!EY19,CD58<=Calcs!EZ19),Lowest20,\nIF(AND(CD58>Calcs!EZ19,CD58<=Calcs!FA19),Inline,\nIF(AND(CD58>Calcs!FA19,CD58<=Calcs!FC19),Middle20,\nIF(AND(CD58>Calcs!FC19,CD58<=Calcs!FD19),Inline,\nIF(AND(CD58>Calcs!FD19,CD58<=Calcs!FE19),Highest20,\nIF(CD58>Calcs!FE19,Highest10,\"\"))))))))","v":""}]
[null,null,"Teacher contact ratio (less than 1.0)","Guidance",null,{"$f":"IFERROR(IF(H14=Calcs!$A$71,('Optional - input raw data'!F32/'Optional - input raw data'!F19),IF(OR(H14=Calcs!$A$72,H14=Calcs!$A$73,H14=Calcs!$A$74),('Optional - input raw data'!F29/('Optional - input raw data'!F28*'Optional - input raw data'!F19)),Calcs!$A$75)),Calcs!$A$75)","v":{"v":0.756077574433215,"d":"0.76"}},null,{"$f":"IF(OR(H$14=\"\",H$15=\"\",H$16=\"\",H$17=\"\",F59=\"\"),\"\",\nIF(F59<=0.7,Muchlower,\nIF(AND(F59>0.7,F59<=0.74),Lower,\nIF(AND(F59>0.74,F59<=0.8),Inline2,\nIF(AND(F59>0.8,F59<=0.82),Higher,\nIF(F59>0.82,Muchhigher,\"\"))))))","v":"Broadly in line with recommendations"},null,{"$f":"IFERROR(IF(L14=Calcs!$A$71,('Optional - input raw data'!H32/'Optional - input raw data'!H19),IF(OR(L14=Calcs!$A$72,L14=Calcs!$A$73,L14=Calcs!$A$74),('Optional - input raw data'!H29/('Optional - input raw data'!H28*'Optional - input raw data'!H19)),Calcs!$A$75)),Calcs!$A$75)","v":""},null,{"$f":"IF(OR(L$14=\"\",L$15=\"\",L$16=\"\",L$17=\"\",J59=\"\"),\"\",\nIF(J59<=0.7,Muchlower,\nIF(AND(J59>0.7,J59<=0.74),Lower,\nIF(AND(J59>0.74,J59<=0.8),Inline2,\nIF(AND(J59>0.8,J59<=0.82),Higher,\nIF(J59>0.82,Muchhigher,\"\"))))))","v":""},null,{"$f":"IFERROR(IF(P14=Calcs!$A$71,('Optional - input raw data'!J32/'Optional - input raw data'!J19),IF(OR(P14=Calcs!$A$72,P14=Calcs!$A$73,P14=Calcs!$A$74),('Optional - input raw data'!J29/('Optional - input raw data'!J28*'Optional - input raw data'!J19)),Calcs!$A$75)),Calcs!$A$75)","v":""},null,{"$f":"IF(OR(P$14=\"\",P$15=\"\",P$16=\"\",P$17=\"\",N59=\"\"),\"\",\nIF(N59<=0.7,Muchlower,\nIF(AND(N59>0.7,N59<=0.74),Lower,\nIF(AND(N59>0.74,N59<=0.8),Inline2,\nIF(AND(N59>0.8,N59<=0.82),Higher,\nIF(N59>0.82,Muchhigher,\"\"))))))","v":""},null,{"$f":"IFERROR(IF(T14=Calcs!$A$71,('Optional - input raw data'!L32/'Optional - input raw data'!L19),IF(OR(T14=Calcs!$A$72,T14=Calcs!$A$73,T14=Calcs!$A$74),('Optional - input raw data'!L29/('Optional - input raw data'!L28*'Optional - input raw data'!L19)),Calcs!$A$75)),Calcs!$A$75)","v":""},null,{"$f":"IF(OR(T$14=\"\",T$15=\"\",T$16=\"\",T$17=\"\",R59=\"\"),\"\",\nIF(R59<=0.7,Muchlower,\nIF(AND(R59>0.7,R59<=0.74),Lower,\nIF(AND(R59>0.74,R59<=0.8),Inline2,\nIF(AND(R59>0.8,R59<=0.82),Higher,\nIF(R59>0.82,Muchhigher,\"\"))))))","v":""},null,{"$f":"IFERROR(IF(X14=\"Primary\",('Optional - input raw data'!N32/'Optional - input raw data'!N19),IF(OR(X14=\"Secondary with sixth form\",X14=\"Secondary without sixth form\",X14=\"All-through\"),('Optional - input raw data'!N29/('Optional - input raw data'!N28*'Optional - input raw data'!N19)),\"\")),\"\")","v":""},null,{"$f":"IF(OR(X$14=\"\",X$15=\"\",X$16=\"\",X$17=\"\",V59=\"\"),\"\",\nIF(V59<=0.7,Muchlower,\nIF(AND(V59>0.7,V59<=0.74),Lower,\nIF(AND(V59>0.74,V59<=0.8),Inline2,\nIF(AND(V59>0.8,V59<=0.82),Higher,\nIF(V59>0.82,Muchhigher,\"\"))))))","v":""},null,{"$f":"IFERROR(IF(AB14=\"Primary\",('Optional - input raw data'!P32/'Optional - input raw data'!P19),IF(OR(AB14=\"Secondary with sixth form\",AB14=\"Secondary without sixth form\",AB14=\"All-through\"),('Optional - input raw data'!P29/('Optional - input raw data'!P28*'Optional - input raw data'!P19)),\"\")),\"\")","v":""},null,{"$f":"IF(OR(AB$14=\"\",AB$15=\"\",AB$16=\"\",AB$17=\"\",Z59=\"\"),\"\",\nIF(Z59<=0.7,Muchlower,\nIF(AND(Z59>0.7,Z59<=0.74),Lower,\nIF(AND(Z59>0.74,Z59<=0.8),Inline2,\nIF(AND(Z59>0.8,Z59<=0.82),Higher,\nIF(Z59>0.82,Muchhigher,\"\"))))))","v":""},null,{"$f":"IFERROR(IF(AF14=\"Primary\",('Optional - input raw data'!R32/'Optional - input raw data'!R19),IF(OR(AF14=\"Secondary with sixth form\",AF14=\"Secondary without sixth form\",AF14=\"All-through\"),('Optional - input raw data'!R29/('Optional - input raw data'!R28*'Optional - input raw data'!R19)),\"\")),\"\")","v":""},null,{"$f":"IF(OR(AF$14=\"\",AF$15=\"\",AF$16=\"\",AF$17=\"\",AD59=\"\"),\"\",\nIF(AD59<=0.7,Muchlower,\nIF(AND(AD59>0.7,AD59<=0.74),Lower,\nIF(AND(AD59>0.74,AD59<=0.8),Inline2,\nIF(AND(AD59>0.8,AD59<=0.82),Higher,\nIF(AD59>0.82,Muchhigher,\"\"))))))","v":""},null,{"$f":"IFERROR(IF(AJ14=\"Primary\",('Optional - input raw data'!T32/'Optional - input raw data'!T19),IF(OR(AJ14=\"Secondary with sixth form\",AJ14=\"Secondary without sixth form\",AJ14=\"All-through\"),('Optional - input raw data'!T29/('Optional - input raw data'!T28*'Optional - input raw data'!T19)),\"\")),\"\")","v":""},null,{"$f":"IF(OR(AJ$14=\"\",AJ$15=\"\",AJ$16=\"\",AJ$17=\"\",AH59=\"\"),\"\",\nIF(AH59<=0.7,Muchlower,\nIF(AND(AH59>0.7,AH59<=0.74),Lower,\nIF(AND(AH59>0.74,AH59<=0.8),Inline2,\nIF(AND(AH59>0.8,AH59<=0.82),Higher,\nIF(AH59>0.82,Muchhigher,\"\"))))))","v":""},null,{"$f":"IFERROR(IF(AN14=\"Primary\",('Optional - input raw data'!V32/'Optional - input raw data'!V19),IF(OR(AN14=\"Secondary with sixth form\",AN14=\"Secondary without sixth form\",AN14=\"All-through\"),('Optional - input raw data'!V29/('Optional - input raw data'!V28*'Optional - input raw data'!V19)),\"\")),\"\")","v":""},null,{"$f":"IF(OR(AN$14=\"\",AN$15=\"\",AN$16=\"\",AN$17=\"\",AL59=\"\"),\"\",\nIF(AL59<=0.7,Muchlower,\nIF(AND(AL59>0.7,AL59<=0.74),Lower,\nIF(AND(AL59>0.74,AL59<=0.8),Inline2,\nIF(AND(AL59>0.8,AL59<=0.82),Higher,\nIF(AL59>0.82,Muchhigher,\"\"))))))","v":""},null,{"$f":"IFERROR(IF(AR14=\"Primary\",('Optional - input raw data'!X32/'Optional - input raw data'!X19),IF(OR(AR14=\"Secondary with sixth form\",AR14=\"Secondary without sixth form\",AR14=\"All-through\"),('Optional - input raw data'!X29/('Optional - input raw data'!X28*'Optional - input raw data'!X19)),\"\")),\"\")","v":""},null,{"$f":"IF(OR(AR$14=\"\",AR$15=\"\",AR$16=\"\",AR$17=\"\",AP59=\"\"),\"\",\nIF(AP59<=0.7,Muchlower,\nIF(AND(AP59>0.7,AP59<=0.74),Lower,\nIF(AND(AP59>0.74,AP59<=0.8),Inline2,\nIF(AND(AP59>0.8,AP59<=0.82),Higher,\nIF(AP59>0.82,Muchhigher,\"\"))))))","v":""},null,{"$f":"IFERROR(IF(AV14=\"Primary\",('Optional - input raw data'!Z32/'Optional - input raw data'!Z19),IF(OR(AV14=\"Secondary with sixth form\",AV14=\"Secondary without sixth form\",AV14=\"All-through\"),('Optional - input raw data'!Z29/('Optional - input raw data'!Z28*'Optional - input raw data'!Z19)),\"\")),\"\")","v":""},null,{"$f":"IF(OR(AV$14=\"\",AV$15=\"\",AV$16=\"\",AV$17=\"\",AT59=\"\"),\"\",\nIF(AT59<=0.7,Muchlower,\nIF(AND(AT59>0.7,AT59<=0.74),Lower,\nIF(AND(AT59>0.74,AT59<=0.8),Inline2,\nIF(AND(AT59>0.8,AT59<=0.82),Higher,\nIF(AT59>0.82,Muchhigher,\"\"))))))","v":""},null,{"$f":"IFERROR(IF(AZ14=\"Primary\",('Optional - input raw data'!AB32/'Optional - input raw data'!AB19),IF(OR(AZ14=\"Secondary with sixth form\",AZ14=\"Secondary without sixth form\",AZ14=\"All-through\"),('Optional - input raw data'!AB29/('Optional - input raw data'!AB28*'Optional - input raw data'!AB19)),\"\")),\"\")","v":""},null,{"$f":"IF(OR(AZ$14=\"\",AZ$15=\"\",AZ$16=\"\",AZ$17=\"\",AX59=\"\"),\"\",\nIF(AX59<=0.7,Muchlower,\nIF(AND(AX59>0.7,AX59<=0.74),Lower,\nIF(AND(AX59>0.74,AX59<=0.8),Inline2,\nIF(AND(AX59>0.8,AX59<=0.82),Higher,\nIF(AX59>0.82,Muchhigher,\"\"))))))","v":""},null,{"$f":"IFERROR(IF(BD14=\"Primary\",('Optional - input raw data'!AD32/'Optional - input raw data'!AD19),IF(OR(BD14=\"Secondary with sixth form\",BD14=\"Secondary without sixth form\",BD14=\"All-through\"),('Optional - input raw data'!AD29/('Optional - input raw data'!AD28*'Optional - input raw data'!AD19)),\"\")),\"\")","v":""},null,{"$f":"IF(OR(BD$14=\"\",BD$15=\"\",BD$16=\"\",BD$17=\"\",BB59=\"\"),\"\",\nIF(BB59<=0.7,Muchlower,\nIF(AND(BB59>0.7,BB59<=0.74),Lower,\nIF(AND(BB59>0.74,BB59<=0.8),Inline2,\nIF(AND(BB59>0.8,BB59<=0.82),Higher,\nIF(BB59>0.82,Muchhigher,\"\"))))))","v":""},null,{"$f":"IFERROR(IF(BH14=\"Primary\",('Optional - input raw data'!AF32/'Optional - input raw data'!AF19),IF(OR(BH14=\"Secondary with sixth form\",BH14=\"Secondary without sixth form\",BH14=\"All-through\"),('Optional - input raw data'!AF29/('Optional - input raw data'!AF28*'Optional - input raw data'!AF19)),\"\")),\"\")","v":""},null,{"$f":"IF(OR(BH$14=\"\",BH$15=\"\",BH$16=\"\",BH$17=\"\",BF59=\"\"),\"\",\nIF(BF59<=0.7,Muchlower,\nIF(AND(BF59>0.7,BF59<=0.74),Lower,\nIF(AND(BF59>0.74,BF59<=0.8),Inline2,\nIF(AND(BF59>0.8,BF59<=0.82),Higher,\nIF(BF59>0.82,Muchhigher,\"\"))))))","v":""},null,{"$f":"IFERROR(IF(BL14=\"Primary\",('Optional - input raw data'!AH32/'Optional - input raw data'!AH19),IF(OR(BL14=\"Secondary with sixth form\",BL14=\"Secondary without sixth form\",BL14=\"All-through\"),('Optional - input raw data'!AH29/('Optional - input raw data'!AH28*'Optional - input raw data'!AH19)),\"\")),\"\")","v":""},null,{"$f":"IF(OR(BL$14=\"\",BL$15=\"\",BL$16=\"\",BL$17=\"\",BJ59=\"\"),\"\",\nIF(BJ59<=0.7,Muchlower,\nIF(AND(BJ59>0.7,BJ59<=0.74),Lower,\nIF(AND(BJ59>0.74,BJ59<=0.8),Inline2,\nIF(AND(BJ59>0.8,BJ59<=0.82),Higher,\nIF(BJ59>0.82,Muchhigher,\"\"))))))","v":""},null,{"$f":"IFERROR(IF(BP14=\"Primary\",('Optional - input raw data'!AJ32/'Optional - input raw data'!AJ19),IF(OR(BP14=\"Secondary with sixth form\",BP14=\"Secondary without sixth form\",BP14=\"All-through\"),('Optional - input raw data'!AJ29/('Optional - input raw data'!AJ28*'Optional - input raw data'!AJ19)),\"\")),\"\")","v":""},null,{"$f":"IF(OR(BP$14=\"\",BP$15=\"\",BP$16=\"\",BP$17=\"\",BN59=\"\"),\"\",\nIF(BN59<=0.7,Muchlower,\nIF(AND(BN59>0.7,BN59<=0.74),Lower,\nIF(AND(BN59>0.74,BN59<=0.8),Inline2,\nIF(AND(BN59>0.8,BN59<=0.82),Higher,\nIF(BN59>0.82,Muchhigher,\"\"))))))","v":""},null,{"$f":"IFERROR(IF(BT14=\"Primary\",('Optional - input raw data'!AL32/'Optional - input raw data'!AL19),IF(OR(BT14=\"Secondary with sixth form\",BT14=\"Secondary without sixth form\",BT14=\"All-through\"),('Optional - input raw data'!AL29/('Optional - input raw data'!AL28*'Optional - input raw data'!AL19)),\"\")),\"\")","v":""},null,{"$f":"IF(OR(BT$14=\"\",BT$15=\"\",BT$16=\"\",BT$17=\"\",BR59=\"\"),\"\",\nIF(BR59<=0.7,Muchlower,\nIF(AND(BR59>0.7,BR59<=0.74),Lower,\nIF(AND(BR59>0.74,BR59<=0.8),Inline2,\nIF(AND(BR59>0.8,BR59<=0.82),Higher,\nIF(BR59>0.82,Muchhigher,\"\"))))))","v":""},null,{"$f":"IFERROR(IF(BX14=\"Primary\",('Optional - input raw data'!AN32/'Optional - input raw data'!AN19),IF(OR(BX14=\"Secondary with sixth form\",BX14=\"Secondary without sixth form\",BX14=\"All-through\"),('Optional - input raw data'!AN29/('Optional - input raw data'!AN28*'Optional - input raw data'!AN19)),\"\")),\"\")","v":""},null,{"$f":"IF(OR(BX$14=\"\",BX$15=\"\",BX$16=\"\",BX$17=\"\",BV59=\"\"),\"\",\nIF(BV59<=0.7,Muchlower,\nIF(AND(BV59>0.7,BV59<=0.74),Lower,\nIF(AND(BV59>0.74,BV59<=0.8),Inline2,\nIF(AND(BV59>0.8,BV59<=0.82),Higher,\nIF(BV59>0.82,Muchhigher,\"\"))))))","v":""},null,{"$f":"IFERROR(IF(CB14=\"Primary\",('Optional - input raw data'!AP32/'Optional - input raw data'!AP19),IF(OR(CB14=\"Secondary with sixth form\",CB14=\"Secondary without sixth form\",CB14=\"All-through\"),('Optional - input raw data'!AP29/('Optional - input raw data'!AP28*'Optional - input raw data'!AP19)),\"\")),\"\")","v":""},null,{"$f":"IF(OR(CB$14=\"\",CB$15=\"\",CB$16=\"\",CB$17=\"\",BZ59=\"\"),\"\",\nIF(BZ59<=0.7,Muchlower,\nIF(AND(BZ59>0.7,BZ59<=0.74),Lower,\nIF(AND(BZ59>0.74,BZ59<=0.8),Inline2,\nIF(AND(BZ59>0.8,BZ59<=0.82),Higher,\nIF(BZ59>0.82,Muchhigher,\"\"))))))","v":""},null,{"$f":"IFERROR(IF(CF14=Calcs!$A$71,('Optional - input raw data'!AR32/'Optional - input raw data'!AR19),IF(OR(CF14=Calcs!$A$72,CF14=Calcs!$A$73,CF14=Calcs!$A$74),('Optional - input raw data'!AR29/('Optional - input raw data'!AR28*'Optional - input raw data'!AR19)),Calcs!$A$75)),Calcs!$A$75)","v":""},null,{"$f":"IF(OR(CF$14=\"\",CF$15=\"\",CF$16=\"\",CF$17=\"\",CD59=\"\"),\"\",\nIF(CD59<=0.7,Muchlower,\nIF(AND(CD59>0.7,CD59<=0.74),Lower,\nIF(AND(CD59>0.74,CD59<=0.8),Inline2,\nIF(AND(CD59>0.8,CD59<=0.82),Higher,\nIF(CD59>0.82,Muchhigher,\"\"))))))","v":""}]
[null,null,"Predicted percentage pupil number change in 3-5 years","Guidance",{"$nulls":3},{"$f":"IF(OR(H$14=\"\",H$15=\"\",H$16=\"\",H$17=\"\",F60=\"\"),\"\",\nIF(F60<=-0.1,High,\nIF(AND(F60>-0.1,F60<=-0.02),Medium,\nIF(F60>=-0.02,Low,\"\"))))","v":""},{"$nulls":3},{"$f":"IF(OR(L$14=\"\",L$15=\"\",L$16=\"\",L$17=\"\",J60=\"\"),\"\",\nIF(J60<=-0.1,High,\nIF(AND(J60>-0.1,J60<=-0.02),Medium,\nIF(J60>=-0.02,Low,\"\"))))","v":""},{"$nulls":3},{"$f":"IF(OR(P$14=\"\",P$15=\"\",P$16=\"\",P$17=\"\",N60=\"\"),\"\",\nIF(N60<=-0.1,High,\nIF(AND(N60>-0.1,N60<=-0.02),Medium,\nIF(N60>=-0.02,Low,\"\"))))","v":""},{"$nulls":3},{"$f":"IF(OR(T$14=\"\",T$15=\"\",T$16=\"\",T$17=\"\",R60=\"\"),\"\",\nIF(R60<=-0.1,High,\nIF(AND(R60>-0.1,R60<=-0.02),Medium,\nIF(R60>=-0.02,Low,\"\"))))","v":""},{"$nulls":3},{"$f":"IF(OR(X$14=\"\",X$15=\"\",X$16=\"\",X$17=\"\",V60=\"\"),\"\",\nIF(V60<=-0.1,High,\nIF(AND(V60>-0.1,V60<=-0.02),Medium,\nIF(V60>=-0.02,Low,\"\"))))","v":""},{"$nulls":3},{"$f":"IF(OR(AB$14=\"\",AB$15=\"\",AB$16=\"\",AB$17=\"\",Z60=\"\"),\"\",\nIF(Z60<=-0.1,High,\nIF(AND(Z60>-0.1,Z60<=-0.02),Medium,\nIF(Z60>=-0.02,Low,\"\"))))","v":""},{"$nulls":3},{"$f":"IF(OR(AF$14=\"\",AF$15=\"\",AF$16=\"\",AF$17=\"\",AD60=\"\"),\"\",\nIF(AD60<=-0.1,High,\nIF(AND(AD60>-0.1,AD60<=-0.02),Medium,\nIF(AD60>=-0.02,Low,\"\"))))","v":""},{"$nulls":3},{"$f":"IF(OR(AJ$14=\"\",AJ$15=\"\",AJ$16=\"\",AJ$17=\"\",AH60=\"\"),\"\",\nIF(AH60<=-0.1,High,\nIF(AND(AH60>-0.1,AH60<=-0.02),Medium,\nIF(AH60>=-0.02,Low,\"\"))))","v":""},{"$nulls":3},{"$f":"IF(OR(AN$14=\"\",AN$15=\"\",AN$16=\"\",AN$17=\"\",AL60=\"\"),\"\",\nIF(AL60<=-0.1,High,\nIF(AND(AL60>-0.1,AL60<=-0.02),Medium,\nIF(AL60>=-0.02,Low,\"\"))))","v":""},{"$nulls":3},{"$f":"IF(OR(AR$14=\"\",AR$15=\"\",AR$16=\"\",AR$17=\"\",AP60=\"\"),\"\",\nIF(AP60<=-0.1,High,\nIF(AND(AP60>-0.1,AP60<=-0.02),Medium,\nIF(AP60>=-0.02,Low,\"\"))))","v":""},{"$nulls":3},{"$f":"IF(OR(AV$14=\"\",AV$15=\"\",AV$16=\"\",AV$17=\"\",AT60=\"\"),\"\",\nIF(AT60<=-0.1,High,\nIF(AND(AT60>-0.1,AT60<=-0.02),Medium,\nIF(AT60>=-0.02,Low,\"\"))))","v":""},{"$nulls":3},{"$f":"IF(OR(AZ$14=\"\",AZ$15=\"\",AZ$16=\"\",AZ$17=\"\",AX60=\"\"),\"\",\nIF(AX60<=-0.1,High,\nIF(AND(AX60>-0.1,AX60<=-0.02),Medium,\nIF(AX60>=-0.02,Low,\"\"))))","v":""},{"$nulls":3},{"$f":"IF(OR(BD$14=\"\",BD$15=\"\",BD$16=\"\",BD$17=\"\",BB60=\"\"),\"\",\nIF(BB60<=-0.1,High,\nIF(AND(BB60>-0.1,BB60<=-0.02),Medium,\nIF(BB60>=-0.02,Low,\"\"))))","v":""},{"$nulls":3},{"$f":"IF(OR(BH$14=\"\",BH$15=\"\",BH$16=\"\",BH$17=\"\",BF60=\"\"),\"\",\nIF(BF60<=-0.1,High,\nIF(AND(BF60>-0.1,BF60<=-0.02),Medium,\nIF(BF60>=-0.02,Low,\"\"))))","v":""},{"$nulls":3},{"$f":"IF(OR(BL$14=\"\",BL$15=\"\",BL$16=\"\",BL$17=\"\",BJ60=\"\"),\"\",\nIF(BJ60<=-0.1,High,\nIF(AND(BJ60>-0.1,BJ60<=-0.02),Medium,\nIF(BJ60>=-0.02,Low,\"\"))))","v":""},{"$nulls":3},{"$f":"IF(OR(BP$14=\"\",BP$15=\"\",BP$16=\"\",BP$17=\"\",BN60=\"\"),\"\",\nIF(BN60<=-0.1,High,\nIF(AND(BN60>-0.1,BN60<=-0.02),Medium,\nIF(BN60>=-0.02,Low,\"\"))))","v":""},{"$nulls":3},{"$f":"IF(OR(BT$14=\"\",BT$15=\"\",BT$16=\"\",BT$17=\"\",BR60=\"\"),\"\",\nIF(BR60<=-0.1,High,\nIF(AND(BR60>-0.1,BR60<=-0.02),Medium,\nIF(BR60>=-0.02,Low,\"\"))))","v":""},{"$nulls":3},{"$f":"IF(OR(BX$14=\"\",BX$15=\"\",BX$16=\"\",BX$17=\"\",BV60=\"\"),\"\",\nIF(BV60<=-0.1,High,\nIF(AND(BV60>-0.1,BV60<=-0.02),Medium,\nIF(BV60>=-0.02,Low,\"\"))))","v":""},{"$nulls":3},{"$f":"IF(OR(CB$14=\"\",CB$15=\"\",CB$16=\"\",CB$17=\"\",BZ60=\"\"),\"\",\nIF(BZ60<=-0.1,High,\nIF(AND(BZ60>-0.1,BZ60<=-0.02),Medium,\nIF(BZ60>=-0.02,Low,\"\"))))","v":""},{"$nulls":3},{"$f":"IF(OR(CF$14=\"\",CF$15=\"\",CF$16=\"\",CF$17=\"\",CD60=\"\"),\"\",\nIF(CD60<=-0.1,High,\nIF(AND(CD60>-0.1,CD60<=-0.02),Medium,\nIF(CD60>=-0.02,Low,\"\"))))","v":""}]
[null,null,"Average class size","Guidance",{"$nulls":3},{"$f":"IF(OR(H$14=\"\",H$15=\"\",H$16=\"\",H$17=\"\",F61=\"\"),\"\",\nIF(F61<=Calcs!C20,Lowest10,\nIF(AND(F61>Calcs!C20,F61<=Calcs!D20),Lowest20,\nIF(AND(F61>Calcs!D20,F61<=Calcs!E20),Inline,\nIF(AND(F61>Calcs!E20,F61<=Calcs!G20),Middle20,\nIF(AND(F61>Calcs!G20,F61<=Calcs!H20),Inline,\nIF(AND(F61>Calcs!H20,F61<=Calcs!I20),Highest20,\nIF(F61>Calcs!I20,Highest10,\"\"))))))))","v":""},{"$nulls":3},{"$f":"IF(OR(L$14=\"\",L$15=\"\",L$16=\"\",L$17=\"\",J61=\"\"),\"\",\nIF(J61<=Calcs!K20,Lowest10,\nIF(AND(J61>Calcs!K20,J61<=Calcs!L20),Lowest20,\nIF(AND(J61>Calcs!L20,J61<=Calcs!M20),Inline,\nIF(AND(J61>Calcs!M20,J61<=Calcs!O20),Middle20,\nIF(AND(J61>Calcs!O20,J61<=Calcs!P20),Inline,\nIF(AND(J61>Calcs!P20,J61<=Calcs!Q20),Highest20,\nIF(J61>Calcs!Q20,Highest10,\"\"))))))))","v":""},{"$nulls":3},{"$f":"IF(OR(P$14=\"\",P$15=\"\",P$16=\"\",P$17=\"\",N61=\"\"),\"\",\nIF(N61<=Calcs!S20,Lowest10,\nIF(AND(N61>Calcs!S20,N61<=Calcs!T20),Lowest20,\nIF(AND(N61>Calcs!T20,N61<=Calcs!U20),Inline,\nIF(AND(N61>Calcs!U20,N61<=Calcs!W20),Middle20,\nIF(AND(N61>Calcs!W20,N61<=Calcs!X20),Inline,\nIF(AND(N61>Calcs!X20,N61<=Calcs!Y20),Highest20,\nIF(N61>Calcs!Y20,Highest10,\"\"))))))))","v":""},{"$nulls":3},{"$f":"IF(OR(T$14=\"\",T$15=\"\",T$16=\"\",T$17=\"\",R61=\"\"),\"\",\nIF(R61<=Calcs!AA20,Lowest10,\nIF(AND(R61>Calcs!AA20,R61<=Calcs!AB20),Lowest20,\nIF(AND(R61>Calcs!AB20,R61<=Calcs!AC20),Inline,\nIF(AND(R61>Calcs!AC20,R61<=Calcs!AE20),Middle20,\nIF(AND(R61>Calcs!AE20,R61<=Calcs!AF20),Inline,\nIF(AND(R61>Calcs!AF20,R61<=Calcs!AG20),Highest20,\nIF(R61>Calcs!AG20,Highest10,\"\"))))))))","v":""},{"$nulls":3},{"$f":"IF(OR(X$14=\"\",X$15=\"\",X$16=\"\",X$17=\"\",V61=\"\"),\"\",\nIF(V61<=Calcs!AI20,Lowest10,\nIF(AND(V61>Calcs!AI20,V61<=Calcs!AJ20),Lowest20,\nIF(AND(V61>Calcs!AJ20,V61<=Calcs!AK20),Inline,\nIF(AND(V61>Calcs!AK20,V61<=Calcs!AM20),Middle20,\nIF(AND(V61>Calcs!AM20,V61<=Calcs!AN20),Inline,\nIF(AND(V61>Calcs!AN20,V61<=Calcs!AO20),Highest20,\nIF(V61>Calcs!AO20,Highest10,\"\"))))))))","v":""},{"$nulls":3},{"$f":"IF(OR(AB$14=\"\",AB$15=\"\",AB$16=\"\",AB$17=\"\",Z61=\"\"),\"\",\nIF(Z61<=Calcs!AQ20,Lowest10,\nIF(AND(Z61>Calcs!AQ20,Z61<=Calcs!AR20),Lowest20,\nIF(AND(Z61>Calcs!AR20,Z61<=Calcs!AS20),Inline,\nIF(AND(Z61>Calcs!AS20,Z61<=Calcs!AU20),Middle20,\nIF(AND(Z61>Calcs!AU20,Z61<=Calcs!AV20),Inline,\nIF(AND(Z61>Calcs!AV20,Z61<=Calcs!AW20),Highest20,\nIF(Z61>Calcs!AW20,Highest10,\"\"))))))))","v":""},{"$nulls":3},{"$f":"IF(OR(AF$14=\"\",AF$15=\"\",AF$16=\"\",AF$17=\"\",AD61=\"\"),\"\",\nIF(AD61<=Calcs!AY20,Lowest10,\nIF(AND(AD61>Calcs!AY20,AD61<=Calcs!AZ20),Lowest20,\nIF(AND(AD61>Calcs!AZ20,AD61<=Calcs!BA20),Inline,\nIF(AND(AD61>Calcs!BA20,AD61<=Calcs!BC20),Middle20,\nIF(AND(AD61>Calcs!BC20,AD61<=Calcs!BD20),Inline,\nIF(AND(AD61>Calcs!BD20,AD61<=Calcs!BE20),Highest20,\nIF(AD61>Calcs!BE20,Highest10,\"\"))))))))","v":""},{"$nulls":3},{"$f":"IF(OR(AJ$14=\"\",AJ$15=\"\",AJ$16=\"\",AJ$17=\"\",AH61=\"\"),\"\",\nIF(AH61<=Calcs!BG20,Lowest10,\nIF(AND(AH61>Calcs!BG20,AH61<=Calcs!BH20),Lowest20,\nIF(AND(AH61>Calcs!BH20,AH61<=Calcs!BI20),Inline,\nIF(AND(AH61>Calcs!BI20,AH61<=Calcs!BK20),Middle20,\nIF(AND(AH61>Calcs!BK20,AH61<=Calcs!BL20),Inline,\nIF(AND(AH61>Calcs!BL20,AH61<=Calcs!BM20),Highest20,\nIF(AH61>Calcs!BM20,Highest10,\"\"))))))))","v":""},{"$nulls":3},{"$f":"IF(OR(AN$14=\"\",AN$15=\"\",AN$16=\"\",AN$17=\"\",AL61=\"\"),\"\",\nIF(AL61<=Calcs!BO20,Lowest10,\nIF(AND(AL61>Calcs!BO20,AL61<=Calcs!BP20),Lowest20,\nIF(AND(AL61>Calcs!BP20,AL61<=Calcs!BQ20),Inline,\nIF(AND(AL61>Calcs!BQ20,AL61<=Calcs!BS20),Middle20,\nIF(AND(AL61>Calcs!BS20,AL61<=Calcs!BT20),Inline,\nIF(AND(AL61>Calcs!BT20,AL61<=Calcs!BU20),Highest20,\nIF(AL61>Calcs!BU20,Highest10,\"\"))))))))","v":""},{"$nulls":3},{"$f":"IF(OR(AR$14=\"\",AR$15=\"\",AR$16=\"\",AR$17=\"\",AP61=\"\"),\"\",\nIF(AP61<=Calcs!BW20,Lowest10,\nIF(AND(AP61>Calcs!BW20,AP61<=Calcs!BX20),Lowest20,\nIF(AND(AP61>Calcs!BX20,AP61<=Calcs!BY20),Inline,\nIF(AND(AP61>Calcs!BY20,AP61<=Calcs!CA20),Middle20,\nIF(AND(AP61>Calcs!CA20,AP61<=Calcs!CB20),Inline,\nIF(AND(AP61>Calcs!CB20,AP61<=Calcs!CC20),Highest20,\nIF(AP61>Calcs!CC20,Highest10,\"\"))))))))","v":""},{"$nulls":3},{"$f":"IF(OR(AV$14=\"\",AV$15=\"\",AV$16=\"\",AV$17=\"\",AT61=\"\"),\"\",\nIF(AT61<=Calcs!CE20,Lowest10,\nIF(AND(AT61>Calcs!CE20,AT61<=Calcs!CF20),Lowest20,\nIF(AND(AT61>Calcs!CF20,AT61<=Calcs!CG20),Inline,\nIF(AND(AT61>Calcs!CG20,AT61<=Calcs!CI20),Middle20,\nIF(AND(AT61>Calcs!CI20,AT61<=Calcs!CJ20),Inline,\nIF(AND(AT61>Calcs!CJ20,AT61<=Calcs!CK20),Highest20,\nIF(AT61>Calcs!CK20,Highest10,\"\"))))))))","v":""},{"$nulls":3},{"$f":"IF(OR(AZ$14=\"\",AZ$15=\"\",AZ$16=\"\",AZ$17=\"\",AX61=\"\"),\"\",\nIF(AX61<=Calcs!CM20,Lowest10,\nIF(AND(AX61>Calcs!CM20,AX61<=Calcs!CN20),Lowest20,\nIF(AND(AX61>Calcs!CN20,AX61<=Calcs!CO20),Inline,\nIF(AND(AX61>Calcs!CO20,AX61<=Calcs!CQ20),Middle20,\nIF(AND(AX61>Calcs!CQ20,AX61<=Calcs!CR20),Inline,\nIF(AND(AX61>Calcs!CR20,AX61<=Calcs!CS20),Highest20,\nIF(AX61>Calcs!CS20,Highest10,\"\"))))))))","v":""},{"$nulls":3},{"$f":"IF(OR(BD$14=\"\",BD$15=\"\",BD$16=\"\",BD$17=\"\",BB61=\"\"),\"\",\nIF(BB61<=Calcs!CU20,Lowest10,\nIF(AND(BB61>Calcs!CU20,BB61<=Calcs!CV20),Lowest20,\nIF(AND(BB61>Calcs!CV20,BB61<=Calcs!CW20),Inline,\nIF(AND(BB61>Calcs!CW20,BB61<=Calcs!CY20),Middle20,\nIF(AND(BB61>Calcs!CY20,BB61<=Calcs!CZ20),Inline,\nIF(AND(BB61>Calcs!CZ20,BB61<=Calcs!DA20),Highest20,\nIF(BB61>Calcs!DA20,Highest10,\"\"))))))))","v":""},{"$nulls":3},{"$f":"IF(OR(BH$14=\"\",BH$15=\"\",BH$16=\"\",BH$17=\"\",BF61=\"\"),\"\",\nIF(BF61<=Calcs!DC20,Lowest10,\nIF(AND(BF61>Calcs!DC20,BF61<=Calcs!DD20),Lowest20,\nIF(AND(BF61>Calcs!DD20,BF61<=Calcs!DE20),Inline,\nIF(AND(BF61>Calcs!DE20,BF61<=Calcs!DG20),Middle20,\nIF(AND(BF61>Calcs!DG20,BF61<=Calcs!DH20),Inline,\nIF(AND(BF61>Calcs!DH20,BF61<=Calcs!DI20),Highest20,\nIF(BF61>Calcs!DI20,Highest10,\"\"))))))))","v":""},{"$nulls":3},{"$f":"IF(OR(BL$14=\"\",BL$15=\"\",BL$16=\"\",BL$17=\"\",BJ61=\"\"),\"\",\nIF(BJ61<=Calcs!DK20,Lowest10,\nIF(AND(BJ61>Calcs!DK20,BJ61<=Calcs!DL20),Lowest20,\nIF(AND(BJ61>Calcs!DL20,BJ61<=Calcs!DM20),Inline,\nIF(AND(BJ61>Calcs!DM20,BJ61<=Calcs!DO20),Middle20,\nIF(AND(BJ61>Calcs!DO20,BJ61<=Calcs!DP20),Inline,\nIF(AND(BJ61>Calcs!DP20,BJ61<=Calcs!DQ20),Highest20,\nIF(BJ61>Calcs!DQ20,Highest10,\"\"))))))))","v":""},{"$nulls":3},{"$f":"IF(OR(BP$14=\"\",BP$15=\"\",BP$16=\"\",BP$17=\"\",BN61=\"\"),\"\",\nIF(BN61<=Calcs!DS20,Lowest10,\nIF(AND(BN61>Calcs!DS20,BN61<=Calcs!DT20),Lowest20,\nIF(AND(BN61>Calcs!DT20,BN61<=Calcs!DU20),Inline,\nIF(AND(BN61>Calcs!DU20,BN61<=Calcs!DW20),Middle20,\nIF(AND(BN61>Calcs!DW20,BN61<=Calcs!DX20),Inline,\nIF(AND(BN61>Calcs!DX20,BN61<=Calcs!DY20),Highest20,\nIF(BN61>Calcs!DY20,Highest10,\"\"))))))))","v":""},{"$nulls":3},{"$f":"IF(OR(BT$14=\"\",BT$15=\"\",BT$16=\"\",BT$17=\"\",BR61=\"\"),\"\",\nIF(BR61<=Calcs!EA20,Lowest10,\nIF(AND(BR61>Calcs!EA20,BR61<=Calcs!EB20),Lowest20,\nIF(AND(BR61>Calcs!EB20,BR61<=Calcs!EC20),Inline,\nIF(AND(BR61>Calcs!EC20,BR61<=Calcs!EE20),Middle20,\nIF(AND(BR61>Calcs!EE20,BR61<=Calcs!EF20),Inline,\nIF(AND(BR61>Calcs!EF20,BR61<=Calcs!EG20),Highest20,\nIF(BR61>Calcs!EG20,Highest10,\"\"))))))))","v":""},{"$nulls":3},{"$f":"IF(OR(BX$14=\"\",BX$15=\"\",BX$16=\"\",BX$17=\"\",BV61=\"\"),\"\",\nIF(BV61<=Calcs!EI20,Lowest10,\nIF(AND(BV61>Calcs!EI20,BV61<=Calcs!EJ20),Lowest20,\nIF(AND(BV61>Calcs!EJ20,BV61<=Calcs!EK20),Inline,\nIF(AND(BV61>Calcs!EK20,BV61<=Calcs!EM20),Middle20,\nIF(AND(BV61>Calcs!EM20,BV61<=Calcs!EN20),Inline,\nIF(AND(BV61>Calcs!EN20,BV61<=Calcs!EO20),Highest20,\nIF(BV61>Calcs!EO20,Highest10,\"\"))))))))","v":""},{"$nulls":3},{"$f":"IF(OR(CB$14=\"\",CB$15=\"\",CB$16=\"\",CB$17=\"\",BZ61=\"\"),\"\",\nIF(BZ61<=Calcs!EQ20,Lowest10,\nIF(AND(BZ61>Calcs!EQ20,BZ61<=Calcs!ER20),Lowest20,\nIF(AND(BZ61>Calcs!ER20,BZ61<=Calcs!ES20),Inline,\nIF(AND(BZ61>Calcs!ES20,BZ61<=Calcs!EU20),Middle20,\nIF(AND(BZ61>Calcs!EU20,BZ61<=Calcs!EV20),Inline,\nIF(AND(BZ61>Calcs!EV20,BZ61<=Calcs!EW20),Highest20,\nIF(BZ61>Calcs!EW20,Highest10,\"\"))))))))","v":""},{"$nulls":3},{"$f":"IF(OR(CF$14=\"\",CF$15=\"\",CF$16=\"\",CF$17=\"\",CD61=\"\"),\"\",\nIF(CD61<=Calcs!EY20,Lowest10,\nIF(AND(CD61>Calcs!EY20,CD61<=Calcs!EZ20),Lowest20,\nIF(AND(CD61>Calcs!EZ20,CD61<=Calcs!FA20),Inline,\nIF(AND(CD61>Calcs!FA20,CD61<=Calcs!FC20),Middle20,\nIF(AND(CD61>Calcs!FC20,CD61<=Calcs!FD20),Inline,\nIF(AND(CD61>Calcs!FD20,CD61<=Calcs!FE20),Highest20,\nIF(CD61>Calcs!FE20,Highest10,\"\"))))))))","v":""}]
[]
[null,null,"E. Outcomes"]
[]
[null,null,"Ofsted rating","Guidance",null,"Good",null,{"$f":"IF(OR(H$14=\"\",H$15=\"\",H$16=\"\",H$17=\"\",F65=\"\"),\"\",INDIRECT(F65))","v":"Good"},{"$nulls":3},{"$f":"IF(OR(L$14=\"\",L$15=\"\",L$16=\"\",L$17=\"\",J65=\"\"),\"\",INDIRECT(J65))","v":""},{"$nulls":3},{"$f":"IF(OR(P$14=\"\",P$15=\"\",P$16=\"\",P$17=\"\",N65=\"\"),\"\",INDIRECT(N65))","v":""},{"$nulls":3},{"$f":"IF(OR(T$14=\"\",T$15=\"\",T$16=\"\",T$17=\"\",R65=\"\"),\"\",INDIRECT(R65))","v":""},{"$nulls":3},{"$f":"IF(OR(X$14=\"\",X$15=\"\",X$16=\"\",X$17=\"\",V65=\"\"),\"\",INDIRECT(V65))","v":""},{"$nulls":3},{"$f":"IF(OR(AB$14=\"\",AB$15=\"\",AB$16=\"\",AB$17=\"\",Z65=\"\"),\"\",INDIRECT(Z65))","v":""},{"$nulls":3},{"$f":"IF(OR(AF$14=\"\",AF$15=\"\",AF$16=\"\",AF$17=\"\",AD65=\"\"),\"\",INDIRECT(AD65))","v":""},{"$nulls":3},{"$f":"IF(OR(AJ$14=\"\",AJ$15=\"\",AJ$16=\"\",AJ$17=\"\",AH65=\"\"),\"\",INDIRECT(AH65))","v":""},{"$nulls":3},{"$f":"IF(OR(AN$14=\"\",AN$15=\"\",AN$16=\"\",AN$17=\"\",AL65=\"\"),\"\",INDIRECT(AL65))","v":""},{"$nulls":3},{"$f":"IF(OR(AR$14=\"\",AR$15=\"\",AR$16=\"\",AR$17=\"\",AP65=\"\"),\"\",INDIRECT(AP65))","v":""},{"$nulls":3},{"$f":"IF(OR(AV$14=\"\",AV$15=\"\",AV$16=\"\",AV$17=\"\",AT65=\"\"),\"\",INDIRECT(AT65))","v":""},{"$nulls":3},{"$f":"IF(OR(AZ$14=\"\",AZ$15=\"\",AZ$16=\"\",AZ$17=\"\",AX65=\"\"),\"\",INDIRECT(AX65))","v":""},{"$nulls":3},{"$f":"IF(OR(BD$14=\"\",BD$15=\"\",BD$16=\"\",BD$17=\"\",BB65=\"\"),\"\",INDIRECT(BB65))","v":""},{"$nulls":3},{"$f":"IF(OR(BH$14=\"\",BH$15=\"\",BH$16=\"\",BH$17=\"\",BF65=\"\"),\"\",INDIRECT(BF65))","v":""},{"$nulls":3},{"$f":"IF(OR(BL$14=\"\",BL$15=\"\",BL$16=\"\",BL$17=\"\",BJ65=\"\"),\"\",INDIRECT(BJ65))","v":""},{"$nulls":3},{"$f":"IF(OR(BP$14=\"\",BP$15=\"\",BP$16=\"\",BP$17=\"\",BN65=\"\"),\"\",INDIRECT(BN65))","v":""},{"$nulls":3},{"$f":"IF(OR(BT$14=\"\",BT$15=\"\",BT$16=\"\",BT$17=\"\",BR65=\"\"),\"\",INDIRECT(BR65))","v":""},{"$nulls":3},{"$f":"IF(OR(BX$14=\"\",BX$15=\"\",BX$16=\"\",BX$17=\"\",BV65=\"\"),\"\",INDIRECT(BV65))","v":""},{"$nulls":3},{"$f":"IF(OR(CB$14=\"\",CB$15=\"\",CB$16=\"\",CB$17=\"\",BZ65=\"\"),\"\",INDIRECT(BZ65))","v":""},{"$nulls":3},{"$f":"IF(OR(CF$14=\"\",CF$15=\"\",CF$16=\"\",CF$17=\"\",CD65=\"\"),\"\",INDIRECT(CD65))","v":""}]
[null,null,"Progress 8 score","Guidance",null,{"v":-0.21,"d":"-0.2"},null,{"$f":"IF(OR(H$14=\"\",H$15=\"\",H$16=\"\",H$17=\"\",F66=\"\"),\"\",\nIF(F66>=0.5,Wellabove,\nIF(AND(F66>=0,F66<0.5),Average,\nIF(AND(F66>=-0.5,F66<0),Below,\nIF(F66<-0.5,Wellbelow,\"\")))))","v":"Below average"},{"$nulls":3},{"$f":"IF(OR(L$14=\"\",L$15=\"\",L$16=\"\",L$17=\"\",J66=\"\"),\"\",\nIF(J66>=0.5,Wellabove,\nIF(AND(J66>=0,J66<0.5),Average,\nIF(AND(J66>=-0.5,J66<0),Below,\nIF(J66<-0.5,Wellbelow,\"\")))))","v":""},{"$nulls":3},{"$f":"IF(OR(P$14=\"\",P$15=\"\",P$16=\"\",P$17=\"\",N66=\"\"),\"\",\nIF(N66>=0.5,Wellabove,\nIF(AND(N66>=0,N66<0.5),Average,\nIF(AND(N66>=-0.5,N66<0),Below,\nIF(N66<-0.5,Wellbelow,\"\")))))","v":""},{"$nulls":3},{"$f":"IF(OR(T$14=\"\",T$15=\"\",T$16=\"\",T$17=\"\",R66=\"\"),\"\",\nIF(R66>=0.5,Wellabove,\nIF(AND(R66>=0,R66<0.5),Average,\nIF(AND(R66>=-0.5,R66<0),Below,\nIF(R66<-0.5,Wellbelow,\"\")))))","v":""},{"$nulls":3},{"$f":"IF(OR(X$14=\"\",X$15=\"\",X$16=\"\",X$17=\"\",V66=\"\"),\"\",\nIF(V66>=0.5,Wellabove,\nIF(AND(V66>=0,V66<0.5),Average,\nIF(AND(V66>=-0.5,V66<0),Below,\nIF(V66<-0.5,Wellbelow,\"\")))))","v":""},{"$nulls":3},{"$f":"IF(OR(AB$14=\"\",AB$15=\"\",AB$16=\"\",AB$17=\"\",Z66=\"\"),\"\",\nIF(Z66>=0.5,Wellabove,\nIF(AND(Z66>=0,Z66<0.5),Average,\nIF(AND(Z66>=-0.5,Z66<0),Below,\nIF(Z66<-0.5,Wellbelow,\"\")))))","v":""},{"$nulls":3},{"$f":"IF(OR(AF$14=\"\",AF$15=\"\",AF$16=\"\",AF$17=\"\",AD66=\"\"),\"\",\nIF(AD66>=0.5,Wellabove,\nIF(AND(AD66>=0,AD66<0.5),Average,\nIF(AND(AD66>=-0.5,AD66<0),Below,\nIF(AD66<-0.5,Wellbelow,\"\")))))","v":""},{"$nulls":3},{"$f":"IF(OR(AJ$14=\"\",AJ$15=\"\",AJ$16=\"\",AJ$17=\"\",AH66=\"\"),\"\",\nIF(AH66>=0.5,Wellabove,\nIF(AND(AH66>=0,AH66<0.5),Average,\nIF(AND(AH66>=-0.5,AH66<0),Below,\nIF(AH66<-0.5,Wellbelow,\"\")))))","v":""},{"$nulls":3},{"$f":"IF(OR(AN$14=\"\",AN$15=\"\",AN$16=\"\",AN$17=\"\",AL66=\"\"),\"\",\nIF(AL66>=0.5,Wellabove,\nIF(AND(AL66>=0,AL66<0.5),Average,\nIF(AND(AL66>=-0.5,AL66<0),Below,\nIF(AL66<-0.5,Wellbelow,\"\")))))","v":""},{"$nulls":3},{"$f":"IF(OR(AR$14=\"\",AR$15=\"\",AR$16=\"\",AR$17=\"\",AP66=\"\"),\"\",\nIF(AP66>=0.5,Wellabove,\nIF(AND(AP66>=0,AP66<0.5),Average,\nIF(AND(AP66>=-0.5,AP66<0),Below,\nIF(AP66<-0.5,Wellbelow,\"\")))))","v":""},{"$nulls":3},{"$f":"IF(OR(AV$14=\"\",AV$15=\"\",AV$16=\"\",AV$17=\"\",AT66=\"\"),\"\",\nIF(AT66>=0.5,Wellabove,\nIF(AND(AT66>=0,AT66<0.5),Average,\nIF(AND(AT66>=-0.5,AT66<0),Below,\nIF(AT66<-0.5,Wellbelow,\"\")))))","v":""},{"$nulls":3},{"$f":"IF(OR(AZ$14=\"\",AZ$15=\"\",AZ$16=\"\",AZ$17=\"\",AX66=\"\"),\"\",\nIF(AX66>=0.5,Wellabove,\nIF(AND(AX66>=0,AX66<0.5),Average,\nIF(AND(AX66>=-0.5,AX66<0),Below,\nIF(AX66<-0.5,Wellbelow,\"\")))))","v":""},{"$nulls":3},{"$f":"IF(OR(BD$14=\"\",BD$15=\"\",BD$16=\"\",BD$17=\"\",BB66=\"\"),\"\",\nIF(BB66>=0.5,Wellabove,\nIF(AND(BB66>=0,BB66<0.5),Average,\nIF(AND(BB66>=-0.5,BB66<0),Below,\nIF(BB66<-0.5,Wellbelow,\"\")))))","v":""},{"$nulls":3},{"$f":"IF(OR(BH$14=\"\",BH$15=\"\",BH$16=\"\",BH$17=\"\",BF66=\"\"),\"\",\nIF(BF66>=0.5,Wellabove,\nIF(AND(BF66>=0,BF66<0.5),Average,\nIF(AND(BF66>=-0.5,BF66<0),Below,\nIF(BF66<-0.5,Wellbelow,\"\")))))","v":""},{"$nulls":3},{"$f":"IF(OR(BL$14=\"\",BL$15=\"\",BL$16=\"\",BL$17=\"\",BJ66=\"\"),\"\",\nIF(BJ66>=0.5,Wellabove,\nIF(AND(BJ66>=0,BJ66<0.5),Average,\nIF(AND(BJ66>=-0.5,BJ66<0),Below,\nIF(BJ66<-0.5,Wellbelow,\"\")))))","v":""},{"$nulls":3},{"$f":"IF(OR(BP$14=\"\",BP$15=\"\",BP$16=\"\",BP$17=\"\",BN66=\"\"),\"\",\nIF(BN66>=0.5,Wellabove,\nIF(AND(BN66>=0,BN66<0.5),Average,\nIF(AND(BN66>=-0.5,BN66<0),Below,\nIF(BN66<-0.5,Wellbelow,\"\")))))","v":""},{"$nulls":3},{"$f":"IF(OR(BT$14=\"\",BT$15=\"\",BT$16=\"\",BT$17=\"\",BR66=\"\"),\"\",\nIF(BR66>=0.5,Wellabove,\nIF(AND(BR66>=0,BR66<0.5),Average,\nIF(AND(BR66>=-0.5,BR66<0),Below,\nIF(BR66<-0.5,Wellbelow,\"\")))))","v":""},{"$nulls":3},{"$f":"IF(OR(BX$14=\"\",BX$15=\"\",BX$16=\"\",BX$17=\"\",BV66=\"\"),\"\",\nIF(BV66>=0.5,Wellabove,\nIF(AND(BV66>=0,BV66<0.5),Average,\nIF(AND(BV66>=-0.5,BV66<0),Below,\nIF(BV66<-0.5,Wellbelow,\"\")))))","v":""},{"$nulls":3},{"$f":"IF(OR(CB$14=\"\",CB$15=\"\",CB$16=\"\",CB$17=\"\",BZ66=\"\"),\"\",\nIF(BZ66>=0.5,Wellabove,\nIF(AND(BZ66>=0,BZ66<0.5),Average,\nIF(AND(BZ66>=-0.5,BZ66<0),Below,\nIF(BZ66<-0.5,Wellbelow,\"\")))))","v":""},{"$nulls":3},{"$f":"IF(OR(CF$14=\"\",CF$15=\"\",CF$16=\"\",CF$17=\"\",CD66=\"\"),\"\",\nIF(CD66>=0.5,Wellabove,\nIF(AND(CD66>=0,CD66<0.5),Average,\nIF(AND(CD66>=-0.5,CD66<0),Below,\nIF(CD66<-0.5,Wellbelow,\"\")))))","v":""}]
[null,null,"Progress score in reading","Guidance",{"$nulls":3},{"$f":"IF(OR(H$14=\"\",H$15=\"\",H$16=\"\",H$17=\"\",F67=\"\"),\"\",\nIF(F67>=3.1,Wellabove,\nIF(AND(F67>=0,F67<3.1),Average,\nIF(AND(F67>=-2.8,F67<0),Below,\nIF(F67<-2.8,Wellbelow,\"\")))))","v":""},{"$nulls":3},{"$f":"IF(OR(L$14=\"\",L$15=\"\",L$16=\"\",L$17=\"\",J67=\"\"),\"\",\nIF(J67>=3.1,Wellabove,\nIF(AND(J67>=0,J67<3.1),Average,\nIF(AND(J67>=-2.8,J67<0),Below,\nIF(J67<-2.8,Wellbelow,\"\")))))","v":""},{"$nulls":3},{"$f":"IF(OR(P$14=\"\",P$15=\"\",P$16=\"\",P$17=\"\",N67=\"\"),\"\",\nIF(N67>=3.1,Wellabove,\nIF(AND(N67>=0,N67<3.1),Average,\nIF(AND(N67>=-2.8,N67<0),Below,\nIF(N67<-2.8,Wellbelow,\"\")))))","v":""},{"$nulls":3},{"$f":"IF(OR(T$14=\"\",T$15=\"\",T$16=\"\",T$17=\"\",R67=\"\"),\"\",\nIF(R67>=3.1,Wellabove,\nIF(AND(R67>=0,R67<3.1),Average,\nIF(AND(R67>=-2.8,R67<0),Below,\nIF(R67<-2.8,Wellbelow,\"\")))))","v":""},{"$nulls":3},{"$f":"IF(OR(X$14=\"\",X$15=\"\",X$16=\"\",X$17=\"\",V67=\"\"),\"\",\nIF(V67>=3.1,Wellabove,\nIF(AND(V67>=0,V67<3.1),Average,\nIF(AND(V67>=-2.8,V67<0),Below,\nIF(V67<-2.8,Wellbelow,\"\")))))","v":""},{"$nulls":3},{"$f":"IF(OR(AB$14=\"\",AB$15=\"\",AB$16=\"\",AB$17=\"\",Z67=\"\"),\"\",\nIF(Z67>=3.1,Wellabove,\nIF(AND(Z67>=0,Z67<3.1),Average,\nIF(AND(Z67>=-2.8,Z67<0),Below,\nIF(Z67<-2.8,Wellbelow,\"\")))))","v":""},{"$nulls":3},{"$f":"IF(OR(AF$14=\"\",AF$15=\"\",AF$16=\"\",AF$17=\"\",AD67=\"\"),\"\",\nIF(AD67>=3.1,Wellabove,\nIF(AND(AD67>=0,AD67<3.1),Average,\nIF(AND(AD67>=-2.8,AD67<0),Below,\nIF(AD67<-2.8,Wellbelow,\"\")))))","v":""},{"$nulls":3},{"$f":"IF(OR(AJ$14=\"\",AJ$15=\"\",AJ$16=\"\",AJ$17=\"\",AH67=\"\"),\"\",\nIF(AH67>=3.1,Wellabove,\nIF(AND(AH67>=0,AH67<3.1),Average,\nIF(AND(AH67>=-2.8,AH67<0),Below,\nIF(AH67<-2.8,Wellbelow,\"\")))))","v":""},{"$nulls":3},{"$f":"IF(OR(AN$14=\"\",AN$15=\"\",AN$16=\"\",AN$17=\"\",AL67=\"\"),\"\",\nIF(AL67>=3.1,Wellabove,\nIF(AND(AL67>=0,AL67<3.1),Average,\nIF(AND(AL67>=-2.8,AL67<0),Below,\nIF(AL67<-2.8,Wellbelow,\"\")))))","v":""},{"$nulls":3},{"$f":"IF(OR(AR$14=\"\",AR$15=\"\",AR$16=\"\",AR$17=\"\",AP67=\"\"),\"\",\nIF(AP67>=3.1,Wellabove,\nIF(AND(AP67>=0,AP67<3.1),Average,\nIF(AND(AP67>=-2.8,AP67<0),Below,\nIF(AP67<-2.8,Wellbelow,\"\")))))","v":""},{"$nulls":3},{"$f":"IF(OR(AV$14=\"\",AV$15=\"\",AV$16=\"\",AV$17=\"\",AT67=\"\"),\"\",\nIF(AT67>=3.1,Wellabove,\nIF(AND(AT67>=0,AT67<3.1),Average,\nIF(AND(AT67>=-2.8,AT67<0),Below,\nIF(AT67<-2.8,Wellbelow,\"\")))))","v":""},{"$nulls":3},{"$f":"IF(OR(AZ$14=\"\",AZ$15=\"\",AZ$16=\"\",AZ$17=\"\",AX67=\"\"),\"\",\nIF(AX67>=3.1,Wellabove,\nIF(AND(AX67>=0,AX67<3.1),Average,\nIF(AND(AX67>=-2.8,AX67<0),Below,\nIF(AX67<-2.8,Wellbelow,\"\")))))","v":""},{"$nulls":3},{"$f":"IF(OR(BD$14=\"\",BD$15=\"\",BD$16=\"\",BD$17=\"\",BB67=\"\"),\"\",\nIF(BB67>=3.1,Wellabove,\nIF(AND(BB67>=0,BB67<3.1),Average,\nIF(AND(BB67>=-2.8,BB67<0),Below,\nIF(BB67<-2.8,Wellbelow,\"\")))))","v":""},{"$nulls":3},{"$f":"IF(OR(BH$14=\"\",BH$15=\"\",BH$16=\"\",BH$17=\"\",BF67=\"\"),\"\",\nIF(BF67>=3.1,Wellabove,\nIF(AND(BF67>=0,BF67<3.1),Average,\nIF(AND(BF67>=-2.8,BF67<0),Below,\nIF(BF67<-2.8,Wellbelow,\"\")))))","v":""},{"$nulls":3},{"$f":"IF(OR(BL$14=\"\",BL$15=\"\",BL$16=\"\",BL$17=\"\",BJ67=\"\"),\"\",\nIF(BJ67>=3.1,Wellabove,\nIF(AND(BJ67>=0,BJ67<3.1),Average,\nIF(AND(BJ67>=-2.8,BJ67<0),Below,\nIF(BJ67<-2.8,Wellbelow,\"\")))))","v":""},{"$nulls":3},{"$f":"IF(OR(BP$14=\"\",BP$15=\"\",BP$16=\"\",BP$17=\"\",BN67=\"\"),\"\",\nIF(BN67>=3.1,Wellabove,\nIF(AND(BN67>=0,BN67<3.1),Average,\nIF(AND(BN67>=-2.8,BN67<0),Below,\nIF(BN67<-2.8,Wellbelow,\"\")))))","v":""},{"$nulls":3},{"$f":"IF(OR(BT$14=\"\",BT$15=\"\",BT$16=\"\",BT$17=\"\",BR67=\"\"),\"\",\nIF(BR67>=3.1,Wellabove,\nIF(AND(BR67>=0,BR67<3.1),Average,\nIF(AND(BR67>=-2.8,BR67<0),Below,\nIF(BR67<-2.8,Wellbelow,\"\")))))","v":""},{"$nulls":3},{"$f":"IF(OR(BX$14=\"\",BX$15=\"\",BX$16=\"\",BX$17=\"\",BV67=\"\"),\"\",\nIF(BV67>=3.1,Wellabove,\nIF(AND(BV67>=0,BV67<3.1),Average,\nIF(AND(BV67>=-2.8,BV67<0),Below,\nIF(BV67<-2.8,Wellbelow,\"\")))))","v":""},{"$nulls":3},{"$f":"IF(OR(CB$14=\"\",CB$15=\"\",CB$16=\"\",CB$17=\"\",BZ67=\"\"),\"\",\nIF(BZ67>=3.1,Wellabove,\nIF(AND(BZ67>=0,BZ67<3.1),Average,\nIF(AND(BZ67>=-2.8,BZ67<0),Below,\nIF(BZ67<-2.8,Wellbelow,\"\")))))","v":""},{"$nulls":3},{"$f":"IF(OR(CF$14=\"\",CF$15=\"\",CF$16=\"\",CF$17=\"\",CD67=\"\"),\"\",\nIF(CD67>=3.1,Wellabove,\nIF(AND(CD67>=0,CD67<3.1),Average,\nIF(AND(CD67>=-2.8,CD67<0),Below,\nIF(CD67<-2.8,Wellbelow,\"\")))))","v":""}]
[null,null,"Progress score in writing","Guidance",{"$nulls":3},{"$f":"IF(OR(H$14=\"\",H$15=\"\",H$16=\"\",H$17=\"\",F68=\"\"),\"\",\nIF(F68>=2.7,Wellabove,\nIF(AND(F68>=0,F68<2.7),Average,\nIF(AND(F68>=-2.6,F68<0),Below,\nIF(F68<-2.6,Wellbelow,\"\")))))","v":""},{"$nulls":3},{"$f":"IF(OR(L$14=\"\",L$15=\"\",L$16=\"\",L$17=\"\",J68=\"\"),\"\",\nIF(J68>=2.7,Wellabove,\nIF(AND(J68>=0,J68<2.7),Average,\nIF(AND(J68>=-2.6,J68<0),Below,\nIF(J68<-2.6,Wellbelow,\"\")))))","v":""},{"$nulls":3},{"$f":"IF(OR(P$14=\"\",P$15=\"\",P$16=\"\",P$17=\"\",N68=\"\"),\"\",\nIF(N68>=2.7,Wellabove,\nIF(AND(N68>=0,N68<2.7),Average,\nIF(AND(N68>=-2.6,N68<0),Below,\nIF(N68<-2.6,Wellbelow,\"\")))))","v":""},{"$nulls":3},{"$f":"IF(OR(T$14=\"\",T$15=\"\",T$16=\"\",T$17=\"\",R68=\"\"),\"\",\nIF(R68>=2.7,Wellabove,\nIF(AND(R68>=0,R68<2.7),Average,\nIF(AND(R68>=-2.6,R68<0),Below,\nIF(R68<-2.6,Wellbelow,\"\")))))","v":""},{"$nulls":3},{"$f":"IF(OR(X$14=\"\",X$15=\"\",X$16=\"\",X$17=\"\",V68=\"\"),\"\",\nIF(V68>=2.7,Wellabove,\nIF(AND(V68>=0,V68<2.7),Average,\nIF(AND(V68>=-2.6,V68<0),Below,\nIF(V68<-2.6,Wellbelow,\"\")))))","v":""},{"$nulls":3},{"$f":"IF(OR(AB$14=\"\",AB$15=\"\",AB$16=\"\",AB$17=\"\",Z68=\"\"),\"\",\nIF(Z68>=2.7,Wellabove,\nIF(AND(Z68>=0,Z68<2.7),Average,\nIF(AND(Z68>=-2.6,Z68<0),Below,\nIF(Z68<-2.6,Wellbelow,\"\")))))","v":""},{"$nulls":3},{"$f":"IF(OR(AF$14=\"\",AF$15=\"\",AF$16=\"\",AF$17=\"\",AD68=\"\"),\"\",\nIF(AD68>=2.7,Wellabove,\nIF(AND(AD68>=0,AD68<2.7),Average,\nIF(AND(AD68>=-2.6,AD68<0),Below,\nIF(AD68<-2.6,Wellbelow,\"\")))))","v":""},{"$nulls":3},{"$f":"IF(OR(AJ$14=\"\",AJ$15=\"\",AJ$16=\"\",AJ$17=\"\",AH68=\"\"),\"\",\nIF(AH68>=2.7,Wellabove,\nIF(AND(AH68>=0,AH68<2.7),Average,\nIF(AND(AH68>=-2.6,AH68<0),Below,\nIF(AH68<-2.6,Wellbelow,\"\")))))","v":""},{"$nulls":3},{"$f":"IF(OR(AN$14=\"\",AN$15=\"\",AN$16=\"\",AN$17=\"\",AL68=\"\"),\"\",\nIF(AL68>=2.7,Wellabove,\nIF(AND(AL68>=0,AL68<2.7),Average,\nIF(AND(AL68>=-2.6,AL68<0),Below,\nIF(AL68<-2.6,Wellbelow,\"\")))))","v":""},{"$nulls":3},{"$f":"IF(OR(AR$14=\"\",AR$15=\"\",AR$16=\"\",AR$17=\"\",AP68=\"\"),\"\",\nIF(AP68>=2.7,Wellabove,\nIF(AND(AP68>=0,AP68<2.7),Average,\nIF(AND(AP68>=-2.6,AP68<0),Below,\nIF(AP68<-2.6,Wellbelow,\"\")))))","v":""},{"$nulls":3},{"$f":"IF(OR(AV$14=\"\",AV$15=\"\",AV$16=\"\",AV$17=\"\",AT68=\"\"),\"\",\nIF(AT68>=2.7,Wellabove,\nIF(AND(AT68>=0,AT68<2.7),Average,\nIF(AND(AT68>=-2.6,AT68<0),Below,\nIF(AT68<-2.6,Wellbelow,\"\")))))","v":""},{"$nulls":3},{"$f":"IF(OR(AZ$14=\"\",AZ$15=\"\",AZ$16=\"\",AZ$17=\"\",AX68=\"\"),\"\",\nIF(AX68>=2.7,Wellabove,\nIF(AND(AX68>=0,AX68<2.7),Average,\nIF(AND(AX68>=-2.6,AX68<0),Below,\nIF(AX68<-2.6,Wellbelow,\"\")))))","v":""},{"$nulls":3},{"$f":"IF(OR(BD$14=\"\",BD$15=\"\",BD$16=\"\",BD$17=\"\",BB68=\"\"),\"\",\nIF(BB68>=2.7,Wellabove,\nIF(AND(BB68>=0,BB68<2.7),Average,\nIF(AND(BB68>=-2.6,BB68<0),Below,\nIF(BB68<-2.6,Wellbelow,\"\")))))","v":""},{"$nulls":3},{"$f":"IF(OR(BH$14=\"\",BH$15=\"\",BH$16=\"\",BH$17=\"\",BF68=\"\"),\"\",\nIF(BF68>=2.7,Wellabove,\nIF(AND(BF68>=0,BF68<2.7),Average,\nIF(AND(BF68>=-2.6,BF68<0),Below,\nIF(BF68<-2.6,Wellbelow,\"\")))))","v":""},{"$nulls":3},{"$f":"IF(OR(BL$14=\"\",BL$15=\"\",BL$16=\"\",BL$17=\"\",BJ68=\"\"),\"\",\nIF(BJ68>=2.7,Wellabove,\nIF(AND(BJ68>=0,BJ68<2.7),Average,\nIF(AND(BJ68>=-2.6,BJ68<0),Below,\nIF(BJ68<-2.6,Wellbelow,\"\")))))","v":""},{"$nulls":3},{"$f":"IF(OR(BP$14=\"\",BP$15=\"\",BP$16=\"\",BP$17=\"\",BN68=\"\"),\"\",\nIF(BN68>=2.7,Wellabove,\nIF(AND(BN68>=0,BN68<2.7),Average,\nIF(AND(BN68>=-2.6,BN68<0),Below,\nIF(BN68<-2.6,Wellbelow,\"\")))))","v":""},{"$nulls":3},{"$f":"IF(OR(BT$14=\"\",BT$15=\"\",BT$16=\"\",BT$17=\"\",BR68=\"\"),\"\",\nIF(BR68>=2.7,Wellabove,\nIF(AND(BR68>=0,BR68<2.7),Average,\nIF(AND(BR68>=-2.6,BR68<0),Below,\nIF(BR68<-2.6,Wellbelow,\"\")))))","v":""},{"$nulls":3},{"$f":"IF(OR(BX$14=\"\",BX$15=\"\",BX$16=\"\",BX$17=\"\",BV68=\"\"),\"\",\nIF(BV68>=2.7,Wellabove,\nIF(AND(BV68>=0,BV68<2.7),Average,\nIF(AND(BV68>=-2.6,BV68<0),Below,\nIF(BV68<-2.6,Wellbelow,\"\")))))","v":""},{"$nulls":3},{"$f":"IF(OR(CB$14=\"\",CB$15=\"\",CB$16=\"\",CB$17=\"\",BZ68=\"\"),\"\",\nIF(BZ68>=2.7,Wellabove,\nIF(AND(BZ68>=0,BZ68<2.7),Average,\nIF(AND(BZ68>=-2.6,BZ68<0),Below,\nIF(BZ68<-2.6,Wellbelow,\"\")))))","v":""},{"$nulls":3},{"$f":"IF(OR(CF$14=\"\",CF$15=\"\",CF$16=\"\",CF$17=\"\",CD68=\"\"),\"\",\nIF(CD68>=2.7,Wellabove,\nIF(AND(CD68>=0,CD68<2.7),Average,\nIF(AND(CD68>=-2.6,CD68<0),Below,\nIF(CD68<-2.6,Wellbelow,\"\")))))","v":""}]
[null,null,"Progress score in maths","Guidance",{"$nulls":3},{"$f":"IF(OR(H$14=\"\",H$15=\"\",H$16=\"\",H$17=\"\",F69=\"\"),\"\",\nIF(F69>=3.2,Wellabove,\nIF(AND(F69>=0,F69<3.2),Average,\nIF(AND(F69>=-3.2,F69<0),Below,\nIF(F69<-3.2,Wellbelow,\"\")))))","v":""},{"$nulls":3},{"$f":"IF(OR(L$14=\"\",L$15=\"\",L$16=\"\",L$17=\"\",J69=\"\"),\"\",\nIF(J69>=3.2,Wellabove,\nIF(AND(J69>=0,J69<3.2),Average,\nIF(AND(J69>=-3.2,J69<0),Below,\nIF(J69<-3.2,Wellbelow,\"\")))))","v":""},{"$nulls":3},{"$f":"IF(OR(P$14=\"\",P$15=\"\",P$16=\"\",P$17=\"\",N69=\"\"),\"\",\nIF(N69>=3.2,Wellabove,\nIF(AND(N69>=0,N69<3.2),Average,\nIF(AND(N69>=-3.2,N69<0),Below,\nIF(N69<-3.2,Wellbelow,\"\")))))","v":""},{"$nulls":3},{"$f":"IF(OR(T$14=\"\",T$15=\"\",T$16=\"\",T$17=\"\",R69=\"\"),\"\",\nIF(R69>=3.2,Wellabove,\nIF(AND(R69>=0,R69<3.2),Average,\nIF(AND(R69>=-3.2,R69<0),Below,\nIF(R69<-3.2,Wellbelow,\"\")))))","v":""},{"$nulls":3},{"$f":"IF(OR(X$14=\"\",X$15=\"\",X$16=\"\",X$17=\"\",V69=\"\"),\"\",\nIF(V69>=3.2,Wellabove,\nIF(AND(V69>=0,V69<3.2),Average,\nIF(AND(V69>=-3.2,V69<0),Below,\nIF(V69<-3.2,Wellbelow,\"\")))))","v":""},{"$nulls":3},{"$f":"IF(OR(AB$14=\"\",AB$15=\"\",AB$16=\"\",AB$17=\"\",Z69=\"\"),\"\",\nIF(Z69>=3.2,Wellabove,\nIF(AND(Z69>=0,Z69<3.2),Average,\nIF(AND(Z69>=-3.2,Z69<0),Below,\nIF(Z69<-3.2,Wellbelow,\"\")))))","v":""},{"$nulls":3},{"$f":"IF(OR(AF$14=\"\",AF$15=\"\",AF$16=\"\",AF$17=\"\",AD69=\"\"),\"\",\nIF(AD69>=3.2,Wellabove,\nIF(AND(AD69>=0,AD69<3.2),Average,\nIF(AND(AD69>=-3.2,AD69<0),Below,\nIF(AD69<-3.2,Wellbelow,\"\")))))","v":""},{"$nulls":3},{"$f":"IF(OR(AJ$14=\"\",AJ$15=\"\",AJ$16=\"\",AJ$17=\"\",AH69=\"\"),\"\",\nIF(AH69>=3.2,Wellabove,\nIF(AND(AH69>=0,AH69<3.2),Average,\nIF(AND(AH69>=-3.2,AH69<0),Below,\nIF(AH69<-3.2,Wellbelow,\"\")))))","v":""},{"$nulls":3},{"$f":"IF(OR(AN$14=\"\",AN$15=\"\",AN$16=\"\",AN$17=\"\",AL69=\"\"),\"\",\nIF(AL69>=3.2,Wellabove,\nIF(AND(AL69>=0,AL69<3.2),Average,\nIF(AND(AL69>=-3.2,AL69<0),Below,\nIF(AL69<-3.2,Wellbelow,\"\")))))","v":""},{"$nulls":3},{"$f":"IF(OR(AR$14=\"\",AR$15=\"\",AR$16=\"\",AR$17=\"\",AP69=\"\"),\"\",\nIF(AP69>=3.2,Wellabove,\nIF(AND(AP69>=0,AP69<3.2),Average,\nIF(AND(AP69>=-3.2,AP69<0),Below,\nIF(AP69<-3.2,Wellbelow,\"\")))))","v":""},{"$nulls":3},{"$f":"IF(OR(AV$14=\"\",AV$15=\"\",AV$16=\"\",AV$17=\"\",AT69=\"\"),\"\",\nIF(AT69>=3.2,Wellabove,\nIF(AND(AT69>=0,AT69<3.2),Average,\nIF(AND(AT69>=-3.2,AT69<0),Below,\nIF(AT69<-3.2,Wellbelow,\"\")))))","v":""},{"$nulls":3},{"$f":"IF(OR(AZ$14=\"\",AZ$15=\"\",AZ$16=\"\",AZ$17=\"\",AX69=\"\"),\"\",\nIF(AX69>=3.2,Wellabove,\nIF(AND(AX69>=0,AX69<3.2),Average,\nIF(AND(AX69>=-3.2,AX69<0),Below,\nIF(AX69<-3.2,Wellbelow,\"\")))))","v":""},{"$nulls":3},{"$f":"IF(OR(BD$14=\"\",BD$15=\"\",BD$16=\"\",BD$17=\"\",BB69=\"\"),\"\",\nIF(BB69>=3.2,Wellabove,\nIF(AND(BB69>=0,BB69<3.2),Average,\nIF(AND(BB69>=-3.2,BB69<0),Below,\nIF(BB69<-3.2,Wellbelow,\"\")))))","v":""},{"$nulls":3},{"$f":"IF(OR(BH$14=\"\",BH$15=\"\",BH$16=\"\",BH$17=\"\",BF69=\"\"),\"\",\nIF(BF69>=3.2,Wellabove,\nIF(AND(BF69>=0,BF69<3.2),Average,\nIF(AND(BF69>=-3.2,BF69<0),Below,\nIF(BF69<-3.2,Wellbelow,\"\")))))","v":""},{"$nulls":3},{"$f":"IF(OR(BL$14=\"\",BL$15=\"\",BL$16=\"\",BL$17=\"\",BJ69=\"\"),\"\",\nIF(BJ69>=3.2,Wellabove,\nIF(AND(BJ69>=0,BJ69<3.2),Average,\nIF(AND(BJ69>=-3.2,BJ69<0),Below,\nIF(BJ69<-3.2,Wellbelow,\"\")))))","v":""},{"$nulls":3},{"$f":"IF(OR(BP$14=\"\",BP$15=\"\",BP$16=\"\",BP$17=\"\",BN69=\"\"),\"\",\nIF(BN69>=3.2,Wellabove,\nIF(AND(BN69>=0,BN69<3.2),Average,\nIF(AND(BN69>=-3.2,BN69<0),Below,\nIF(BN69<-3.2,Wellbelow,\"\")))))","v":""},{"$nulls":3},{"$f":"IF(OR(BT$14=\"\",BT$15=\"\",BT$16=\"\",BT$17=\"\",BR69=\"\"),\"\",\nIF(BR69>=3.2,Wellabove,\nIF(AND(BR69>=0,BR69<3.2),Average,\nIF(AND(BR69>=-3.2,BR69<0),Below,\nIF(BR69<-3.2,Wellbelow,\"\")))))","v":""},{"$nulls":3},{"$f":"IF(OR(BX$14=\"\",BX$15=\"\",BX$16=\"\",BX$17=\"\",BV69=\"\"),\"\",\nIF(BV69>=3.2,Wellabove,\nIF(AND(BV69>=0,BV69<3.2),Average,\nIF(AND(BV69>=-3.2,BV69<0),Below,\nIF(BV69<-3.2,Wellbelow,\"\")))))","v":""},{"$nulls":3},{"$f":"IF(OR(CB$14=\"\",CB$15=\"\",CB$16=\"\",CB$17=\"\",BZ69=\"\"),\"\",\nIF(BZ69>=3.2,Wellabove,\nIF(AND(BZ69>=0,BZ69<3.2),Average,\nIF(AND(BZ69>=-3.2,BZ69<0),Below,\nIF(BZ69<-3.2,Wellbelow,\"\")))))","v":""},{"$nulls":3},{"$f":"IF(OR(CF$14=\"\",CF$15=\"\",CF$16=\"\",CF$17=\"\",CD69=\"\"),\"\",\nIF(CD69>=3.2,Wellabove,\nIF(AND(CD69>=0,CD69<3.2),Average,\nIF(AND(CD69>=-3.2,CD69<0),Below,\nIF(CD69<-3.2,Wellbelow,\"\")))))","v":""}]
[]
[null,null,"F: Optional commentary"]
[]
[null,null,"[enter text]",null,null,"[enter text]",{"$nulls":3},"[enter text]",{"$nulls":3},"[enter text]",{"$nulls":3},"[enter text]",{"$nulls":3},"[enter text]",{"$nulls":3},"[enter text]",{"$nulls":3},"[enter text]",{"$nulls":3},"[enter text]",{"$nulls":3},"[enter text]",{"$nulls":3},"[enter text]",{"$nulls":3},"[enter text]",{"$nulls":3},"[enter text]",{"$nulls":3},"[enter text]",{"$nulls":3},"[enter text]",{"$nulls":3},"[enter text]",{"$nulls":3},"[enter text]",{"$nulls":3},"[enter text]",{"$nulls":3},"[enter text]",{"$nulls":3},"[enter text]",{"$nulls":3},"[enter text]"]

{"sheet":"Optional - input raw data","index":3,"n_rows":65,"n_cols":44,"rows_kept":65,"merged":[[2,2,2,3],[4,2,15,3],[8,5,9,5],[8,7,9,7],[8,9,9,9],[8,11,9,11],[8,13,9,13],[8,15,9,15],[8,17,9,17],[8,19,9,19],[8,21,9,21],[8,23,9,23],[8,25,9,25],[8,27,9,27],[8,29,9,29],[8,31,9,31],[8,33,9,33],[8,35,9,35],[8,37,9,37],[8,39,9,39],[8,41,9,41],[8,43,9,43],[11,5,15,5],[11,7,15,7],[11,9,15,9],[11,11,15,11],[11,13,15,13],[11,15,15,15],[11,17,15,17],[11,19,15,19],[11,21,15,21],[11,23,15,23],[11,25,15,25],[11,27,15,27],[11,29,15,29],[11,31,15,31],[11,33,15,33],[11,35,15,35],[11,37,15,37],[11,39,15,39],[11,41,15,41],[11,43,15,43],[18,2,18,3],[19,2,19,3],[20,2,20,3],[22,2,22,3],[23,2,23,3],[24,2,24,3],[26,2,26,3],[27,2,27,3],[28,2,28,3],[30,2,30,3],[31,2,31,3]]}
[]
[]
[null,null,"Raw data form"]
[{"$nulls":5},1,null,2,null,3,null,4,null,5,null,6,null,7,null,8,null,9,null,10,null,11,null,12,{"$nulls":3},14,null,15,null,16,null,17,null,18,null,19,null,20]
[null,null,"This form can be used to input raw spend and characteristics information. If used, the information in this table will be used to calculate the percentages and ratios required in the dashboard. The percentages and ratios can also be inputted directly into the dashboard.\n\nSchools should use the most up to date information available to them, and not rely on lagged published data.\n\nAll of the data should refer to the same financial year.\n\nAdd up to 20 schools by using the Click here to add another school buttons. Macros must be enabled for this feature.",{"$nulls":26},13]
[]
[]
[{"$nulls":5},"School name:",null,"School name:",null,"School name:",null,"School name:",null,"School name:",null,"School name:",null,"School name:",null,"School name:",null,"School name:",null,"School name:",null,"School name:",null,"School name:",null,"School name:",null,"School name:",null,"School name:",null,"School name:",null,"School name:",null,"School name:",null,"School name:",null,"School name:"]
[{"$nulls":5},{"$f":"IF(Dashboard!H13=\"\",\"\",Dashboard!H13)","v":"Shenfield High School"},null,{"$f":"IF(Dashboard!L13=\"\",\"\",Dashboard!L13)","v":""},null,{"$f":"IF(Dashboard!P13=\"\",\"\",Dashboard!P13)","v":""},null,{"$f":"IF(Dashboard!T13=\"\",\"\",Dashboard!T13)","v":""},null,{"$f":"IF(Dashboard!X13=\"\",\"\",Dashboard!X13)","v":""},null,{"$f":"IF(Dashboard!AB13=\"\",\"\",Dashboard!AB13)","v":""},null,{"$f":"IF(Dashboard!AF13=\"\",\"\",Dashboard!AF13)","v":""},null,{"$f":"IF(Dashboard!AJ13=\"\",\"\",Dashboard!AJ13)","v":""},null,{"$f":"IF(Dashboard!AN13=\"\",\"\",Dashboard!AN13)","v":""},null,{"$f":"IF(Dashboard!AR13=\"\",\"\",Dashboard!AR13)","v":""},null,{"$f":"IF(Dashboard!AV13=\"\",\"\",Dashboard!AV13)","v":""},null,{"$f":"IF(Dashboard!AZ13=\"\",\"\",Dashboard!AZ13)","v":""},null,{"$f":"IF(Dashboard!BD13=\"\",\"\",Dashboard!BD13)","v":""},null,{"$f":"IF(Dashboard!BH13=\"\",\"\",Dashboard!BH13)","v":""},null,{"$f":"IF(Dashboard!BL13=\"\",\"\",Dashboard!BL13)","v":""},null,{"$f":"IF(Dashboard!BP13=\"\",\"\",Dashboard!BP13)","v":""},null,{"$f":"IF(Dashboard!BT13=\"\",\"\",Dashboard!BT13)","v":""},null,{"$f":"IF(Dashboard!BX13=\"\",\"\",Dashboard!BX13)","v":""},null,{"$f":"IF(Dashboard!CB13=\"\",\"\",Dashboard!CB13)","v":""},null,{"$f":"IF(Dashboard!CF13=\"\",\"\",Dashboard!CF13)","v":""}]
[]
[]
[{"$nulls":5},"Input the raw spending and characteristics data for this school below, or click here to input the school's percentages and ratios directly into the dashboard",null,"Input the raw spending and characteristics data for this school below, or click here to input the school's percentages and ratios directly into the dashboard",null,"Input the raw spending and characteristics data for this school below, or click here to input the school's percentages and ratios directly into the dashboard",null,"Input the raw spending and characteristics data for this school below, or click here to input the school's percentages and ratios directly into the dashboard",null,"Input the raw spending and characteristics data for this school below, or click here to input the school's percentages and ratios directly into the dashboard",null,"Input the raw spending and characteristics data for this school below, or click here to input the school's percentages and ratios directly into the dashboard",null,"Input the raw spending and characteristics data for this school below, or click here to input the school's percentages and ratios directly into the dashboard",null,"Input the raw spending and characteristics data for this school below, or click here to input the school's percentages and ratios directly into the dashboard",null,"Input the raw spending and characteristics data for this school below, or click here to input the school's percentages and ratios directly into the dashboard",null,"Input the raw spending and characteristics data for this school below, or click here to input the school's percentages and ratios directly into the dashboard",null,"Input the raw spending and characteristics data for this school below, or click here to input the school's percentages and ratios directly into the dashboard",null,"Input the raw spending and characteristics data for this school below, or click here to input the school's percentages and ratios directly into the dashboard",null,"Input the raw spending and characteristics data for this school below, or click here to input the school's percentages and ratios directly into the dashboard",null,"Input the raw spending and characteristics data for this school below, or click here to input the school's percentages and ratios directly into the dashboard",null,"Input the raw spending and characteristics data for this school below, or click here to input the school's percentages and ratios directly into the dashboard",null,"Input the raw spending and characteristics data for this school below, or click here to input the school's percentages and ratios directly into the dashboard",null,"Input the raw spending and characteristics data for this school below, or click here to input the school's percentages and ratios directly into the dashboard",null,"Input the raw spending and characteristics data for this school below, or click here to input the school's percentages and ratios directly into the dashboard",null,"Input the raw spending and characteristics data for this school below, or click here to input the school's percentages and ratios directly into the dashboard",null,"Input the raw spending and characteristics data for this school below, or click here to input the school's percentages and ratios directly into the dashboard"]
[]
[]
[]
[]
[]
[]
[null,null,"Full time equivalent number of teachers (classroom and leadership)",null,null,{"v":73.22,"d":"73.2"}]
[null,null,"Full time equivalent of teachers in the leadership group",null,null,{"v":9,"d":"9.0"}]
[null,null,"Full time equivalent of total school workforce",null,null,{"v":126.18,"d":"126.2"}]
[]
[null,null,"Total expenditure",null,null,{"v":7344512,"d":"£7,344,512"}]
[null,null,"Total income",null,null,{"v":7125706,"d":"£7,125,706"}]
[null,null,"Revenue balances (committed and uncommitted)",null,null,{"v":329596,"d":"£329,596"}]
[]
[null,null,"For secondary and all-through schools:"]
[null,null,"Teaching periods in the timetable cycle",null,null,50]
[null,null,"Total lessons taught by all teachers in the timetable cycle",null,null,{"v":2768,"d":"2,768"}]
[{"$nulls":3},{"$f":"IFERROR(IF((F29/(F28*F19))<0.5,\"Resulting teacher contact ratio is low. Total lessons taught may be incorrectly calculated as too low\",IF((F29/(F28*F19))>1,\"Resulting teacher contact ratio is greater than 1. Total lessons taught is too high\",\"\")),\"\")","v":""}]
[null,null,"For primary schools:"]
[null,null,"Total number of classes"]
[]
[null,null,"E1","Teaching staff",null,{"v":4370608,"d":"£4,370,608"}]
[null,null,"E2","Supply teaching staff",null,{"v":20000,"d":"£20,000"}]
[null,null,"E3","Education support staff",null,{"v":548524,"d":"£548,524"}]
[null,null,"E4","Administrative and clerical staff",null,{"v":729076,"d":"£729,076"}]
[null,null,"E5","Premises staff",null,{"v":157423,"d":"£157,423"}]
[null,null,"E6","Catering staff"]
[null,null,"E7","Cost of other staff",null,{"v":224468,"d":"£224,468"}]
[null,null,"E8","Indirect employee expenses",null,{"v":28000,"d":"£28,000"}]
[null,null,"E9","Staff development and training",null,{"v":12000,"d":"£12,000"}]
[null,null,"E10","Supply teacher insurance",null,{"v":0,"d":"£0"}]
[null,null,"E11","Staff-related insurance"]
[null,null,"E13","Maintenance of premises",null,{"v":54000,"d":"£54,000"}]
[null,null,"E14","Cleaning and caretaking",null,{"v":175600,"d":"£175,600"}]
[null,null,"E15","Water and sewerage",null,{"v":30000,"d":"£30,000"}]
[null,null,"E16","Energy",null,{"v":144000,"d":"£144,000"}]
[null,null,"E17","Rent and rates",null,{"v":34442,"d":"£34,442"}]
[null,null,"E18","Grounds maintenance",null,{"v":15000,"d":"£15,000"}]
[null,null,"E19","Other occupation costs",null,{"v":66508,"d":"£66,508"}]
[null,null,"E21","Special facilities",null,{"v":16000,"d":"£16,000"}]
[null,null,"E22","Teaching resources",null,{"v":150650,"d":"£150,650"}]
[null,null,"E23","ICT teaching resources",null,{"v":94000,"d":"£94,000"}]
[null,null,"E24","Examination fees",null,{"v":125000,"d":"£125,000"}]
[null,null,"E25","Educational consultancy"]
[null,null,"E26","Agency supply teaching staff"]
[null,null,"E28","Catering supplies",null,{"v":12500,"d":"£12,500"}]
[null,null,"E29","Auditor costs"]
[null,null,"E30","Other insurance premiums",null,{"v":33500,"d":"£33,500"}]
[null,null,"E31","Administrative supplies - non educational",null,{"v":139109,"d":"£139,109"}]
[null,null,"E32","Direct revenue financing (revenue contributions to capital)",null,{"v":88254,"d":"£88,254"}]
[null,null,"E33","Professional services - non-curriculum",null,{"v":75855,"d":"£75,855"}]
[null,null,"E35","Interest charges for loan and bank"]
[null,null,"E36","PFI charges"]

{"sheet":"RAG rating data for your school","index":4,"n_rows":97,"n_cols":20,"rows_kept":97,"merged":[[1,7,8,19],[16,3,16,4],[16,6,16,9],[16,11,16,14],[16,16,16,19],[18,1,19,1],[21,1,22,1],[24,1,25,1],[27,1,28,1],[30,1,31,1],[33,1,34,1],[36,1,37,1],[39,1,40,1],[45,3,45,4],[45,6,45,9],[45,11,45,14],[45,16,45,19],[47,1,48,1],[50,1,51,1],[56,3,56,4],[56,6,56,9],[56,11,56,14],[56,16,56,19],[58,1,59,1],[61,1,62,1],[64,1,65,1],[67,1,68,1],[70,1,71,1],[73,1,74,1],[76,1,77,1],[82,3,82,4],[82,6,82,9],[82,11,82,14],[82,16,82,19],[84,1,85,1],[87,1,88,1],[90,1,91,1],[93,1,94,1],[96,1,97,1]]}
[]
[null,"Select which school to show the RAG ratings for:",{"$nulls":5},"The RAG ratings have been calculated using maintained school and academy 2017 to 18 data.\n\nThe majority of metrics in the dashboard are percentages and ratios which at a national level don't change significantly year on year, so they still provide a fair and useful comparison with your up to date data.\n\nThe exception is average teacher cost, which does change year on year. To reflect the latest pay awards (from September 2018 and September 2019) and pensions contribution changes we have uplifted the underlying data by 11.2%. The thresholds therefore reflect average teacher costs for the academic year 2019/20."]
[null,"Shenfield High School"]
[]
[]
[null,"Your school has been identified as:"]
[null,{"$f":"IF($B$3=\"\",\"\",\"- \"&\nINDEX(Calcs!L:L,MATCH($B$3,Calcs!A:A,0)))","v":"- a secondary school with a sixth form"}]
[null,{"$f":"IF($B$3=\"\",\"\",\"- \"&\nINDEX(Calcs!I:I,MATCH($B$3,Calcs!A:A,0)))","v":"- outside London"}]
[null,{"$f":"IF($B$3=\"\",\"\",\nIF(OR($B$7=\"- an alternative provision school\",$B$7=\"- a special school\",$B$7=\"- an all-through school\",$B$7=\"- a nursery school\"),\"\",\n\"- a \"&INDEX(Calcs!J:J,MATCH($B$3,Calcs!A:A,0))&\" school because it has \"&INDEX(Calcs!M:M,MATCH($B$3,Calcs!A:A,0))))","v":"- a large school because it has more than 1300 pupils"}]
[null,{"$f":"IF($B$3=\"\",\"\",\nIF(OR($B$7=\"- an alternative provision school\",$B$7=\"- a special school\",$B$7=\"- an all-through school\",$B$7=\"- a nursery school\"),\"\",\n\"- a school with \"&INDEX(Calcs!K:K,MATCH($B$3,Calcs!A:A,0))&\" because \"&INDEX(Calcs!N:N,MATCH($B$3,Calcs!A:A,0))&\" are eligible\"))","v":"- a school with medium levels of FSM because between 6% and 16.5% of pupils are eligible"}]
[]
[]
[null,"The thresholds for the RAG ratings are based on these characteristics and are:"]
[]
[null,"B. Your spending as a percentage of expenditure"]
[]
[{"$nulls":3},"Red rating",null,null,"Amber rating",{"$nulls":4},"Light green rating",{"$nulls":4},"Dark green rating"]
[]
[null,"Spend on teaching staff as a percentage of total expenditure",null,"Less than or equal to",{"$f":"IF($B$3=\"\",\"\",INDEX(INDIRECT(INDEX(Calcs!$D:$D,MATCH($B$3,Calcs!$A:$A,0))),1,1))","v":{"v":0.5,"d":"50.0%"}},null,"Between",{"$f":"IF($B$3=\"\",\"\",INDEX(INDIRECT(INDEX(Calcs!$D:$D,MATCH($B$3,Calcs!$A:$A,0))),1,1))","v":{"v":0.5,"d":"50.0%"}},"and",{"$f":"IF($B$3=\"\",\"\",INDEX(INDIRECT(INDEX(Calcs!$D:$D,MATCH($B$3,Calcs!$A:$A,0))),1,2))","v":{"v":0.53,"d":"53.0%"}},null,"Between",{"$f":"IF($B$3=\"\",\"\",INDEX(INDIRECT(INDEX(Calcs!$D:$D,MATCH($B$3,Calcs!$A:$A,0))),1,2))","v":{"v":0.53,"d":"53.0%"}},"and",{"$f":"IF($B$3=\"\",\"\",INDEX(INDIRECT(INDEX(Calcs!$D:$D,MATCH($B$3,Calcs!$A:$A,0))),1,3))","v":{"v":0.555,"d":"55.5%"}},null,"Between",{"$f":"IF($B$3=\"\",\"\",INDEX(INDIRECT(INDEX(Calcs!$D:$D,MATCH($B$3,Calcs!$A:$A,0))),1,3))","v":{"v":0.555,"d":"55.5%"}},"and",{"$f":"IF($B$3=\"\",\"\",INDEX(INDIRECT(INDEX(Calcs!$D:$D,MATCH($B$3,Calcs!$A:$A,0))),1,5))","v":{"v":0.575,"d":"57.5%"}}]
[{"$nulls":3},"Or more than ",{"$f":"IF($B$3=\"\",\"\",INDEX(INDIRECT(INDEX(Calcs!$D:$D,MATCH($B$3,Calcs!$A:$A,0))),1,7))","v":{"v":0.635,"d":"63.5%"}},null,"Or between",{"$f":"IF($B$3=\"\",\"\",INDEX(INDIRECT(INDEX(Calcs!$D:$D,MATCH($B$3,Calcs!$A:$A,0))),1,6))","v":{"v":0.61,"d":"61.0%"}},"and",{"$f":"IF($B$3=\"\",\"\",INDEX(INDIRECT(INDEX(Calcs!$D:$D,MATCH($B$3,Calcs!$A:$A,0))),1,7))","v":{"v":0.635,"d":"63.5%"}},null,"Or between",{"$f":"IF($B$3=\"\",\"\",INDEX(INDIRECT(INDEX(Calcs!$D:$D,MATCH($B$3,Calcs!$A:$A,0))),1,5))","v":{"v":0.575,"d":"57.5%"}},"and",{"$f":"IF($B$3=\"\",\"\",INDEX(INDIRECT(INDEX(Calcs!$D:$D,MATCH($B$3,Calcs!$A:$A,0))),1,6))","v":{"v":0.61,"d":"61.0%"}}]
[]
[null,"Spend on supply staff as a percentage of total expenditure",null,"More than",{"$f":"IF($B$3=\"\",\"\",INDEX(INDIRECT(INDEX(Calcs!$D:$D,MATCH($B$3,Calcs!$A:$A,0))),2,7))","v":{"v":0.04,"d":"4.0%"}},null,"Between",{"$f":"IF($B$3=\"\",\"\",INDEX(INDIRECT(INDEX(Calcs!$D:$D,MATCH($B$3,Calcs!$A:$A,0))),2,6))","v":{"v":0.03,"d":"3.0%"}},"and",{"$f":"IF($B$3=\"\",\"\",INDEX(INDIRECT(INDEX(Calcs!$D:$D,MATCH($B$3,Calcs!$A:$A,0))),2,7))","v":{"v":0.04,"d":"4.0%"}},null,"Between",{"$f":"IF($B$3=\"\",\"\",INDEX(INDIRECT(INDEX(Calcs!$D:$D,MATCH($B$3,Calcs!$A:$A,0))),2,5))","v":{"v":0.02,"d":"2.0%"}},"and",{"$f":"IF($B$3=\"\",\"\",INDEX(INDIRECT(INDEX(Calcs!$D:$D,MATCH($B$3,Calcs!$A:$A,0))),2,6))","v":{"v":0.03,"d":"3.0%"}},null,"Between",{"$f":"IF($B$3=\"\",\"\",INDEX(INDIRECT(INDEX(Calcs!$D:$D,MATCH($B$3,Calcs!$A:$A,0))),2,3))","v":{"v":0.01,"d":"1.0%"}},"and",{"$f":"IF($B$3=\"\",\"\",INDEX(INDIRECT(INDEX(Calcs!$D:$D,MATCH($B$3,Calcs!$A:$A,0))),2,5))","v":{"v":0.02,"d":"2.0%"}}]
[{"$nulls":11},"Or less than or equal to",{"$f":"IF($B$3=\"\",\"\",INDEX(INDIRECT(INDEX(Calcs!$D:$D,MATCH($B$3,Calcs!$A:$A,0))),2,3))","v":{"v":0.01,"d":"1.0%"}}]
[]
[null,"Spend on education support staff as a percentage of total expenditure",null,"More than",{"$f":"IF($B$3=\"\",\"\",INDEX(INDIRECT(INDEX(Calcs!$D:$D,MATCH($B$3,Calcs!$A:$A,0))),3,7))","v":{"v":0.13,"d":"13.0%"}},null,"Between",{"$f":"IF($B$3=\"\",\"\",INDEX(INDIRECT(INDEX(Calcs!$D:$D,MATCH($B$3,Calcs!$A:$A,0))),3,6))","v":{"v":0.115,"d":"11.5%"}},"and",{"$f":"IF($B$3=\"\",\"\",INDEX(INDIRECT(INDEX(Calcs!$D:$D,MATCH($B$3,Calcs!$A:$A,0))),3,7))","v":{"v":0.13,"d":"13.0%"}},null,"Between",{"$f":"IF($B$3=\"\",\"\",INDEX(INDIRECT(INDEX(Calcs!$D:$D,MATCH($B$3,Calcs!$A:$A,0))),3,5))","v":{"v":0.1,"d":"10.0%"}},"and",{"$f":"IF($B$3=\"\",\"\",INDEX(INDIRECT(INDEX(Calcs!$D:$D,MATCH($B$3,Calcs!$A:$A,0))),3,6))","v":{"v":0.115,"d":"11.5%"}},null,"Between",{"$f":"IF($B$3=\"\",\"\",INDEX(INDIRECT(INDEX(Calcs!$D:$D,MATCH($B$3,Calcs!$A:$A,0))),3,3))","v":{"v":0.085,"d":"8.5%"}},"and",{"$f":"IF($B$3=\"\",\"\",INDEX(INDIRECT(INDEX(Calcs!$D:$D,MATCH($B$3,Calcs!$A:$A,0))),3,5))","v":{"v":0.1,"d":"10.0%"}}]
[{"$nulls":11},"Or less than or equal to",{"$f":"IF($B$3=\"\",\"\",INDEX(INDIRECT(INDEX(Calcs!$D:$D,MATCH($B$3,Calcs!$A:$A,0))),3,3))","v":{"v":0.085,"d":"8.5%"}}]
[]
[null,"Spend on administrative and clerical staff as a percentage of total expenditure",null,"More than",{"$f":"IF($B$3=\"\",\"\",INDEX(INDIRECT(INDEX(Calcs!$D:$D,MATCH($B$3,Calcs!$A:$A,0))),4,7))","v":{"v":0.1,"d":"10.0%"}},null,"Between",{"$f":"IF($B$3=\"\",\"\",INDEX(INDIRECT(INDEX(Calcs!$D:$D,MATCH($B$3,Calcs!$A:$A,0))),4,6))","v":{"v":0.08,"d":"8.0%"}},"and",{"$f":"IF($B$3=\"\",\"\",INDEX(INDIRECT(INDEX(Calcs!$D:$D,MATCH($B$3,Calcs!$A:$A,0))),4,7))","v":{"v":0.1,"d":"10.0%"}},null,"Less than or equal to",{"$f":"IF($B$3=\"\",\"\",INDEX(INDIRECT(INDEX(Calcs!$D:$D,MATCH($B$3,Calcs!$A:$A,0))),4,6))","v":{"v":0.08,"d":"8.0%"}}]
[]
[]
[null,"Spend on other staff costs as a percentage of total expenditure",null,"More than",{"$f":"IF($B$3=\"\",\"\",INDEX(INDIRECT(INDEX(Calcs!$D:$D,MATCH($B$3,Calcs!$A:$A,0))),5,7))","v":{"v":0.05,"d":"5.0%"}},null,"Between",{"$f":"IF($B$3=\"\",\"\",INDEX(INDIRECT(INDEX(Calcs!$D:$D,MATCH($B$3,Calcs!$A:$A,0))),5,6))","v":{"v":0.03,"d":"3.0%"}},"and",{"$f":"IF($B$3=\"\",\"\",INDEX(INDIRECT(INDEX(Calcs!$D:$D,MATCH($B$3,Calcs!$A:$A,0))),5,7))","v":{"v":0.05,"d":"5.0%"}},null,"Less than or equal to",{"$f":"IF($B$3=\"\",\"\",INDEX(INDIRECT(INDEX(Calcs!$D:$D,MATCH($B$3,Calcs!$A:$A,0))),5,6))","v":{"v":0.03,"d":"3.0%"}}]
[]
[]
[null,"Spend on premises (including staff costs) as a percentage of total expenditure",null,"More than",{"$f":"IF($B$3=\"\",\"\",INDEX(INDIRECT(INDEX(Calcs!$D:$D,MATCH($B$3,Calcs!$A:$A,0))),6,7))","v":{"v":0.085,"d":"8.5%"}},null,"Between",{"$f":"IF($B$3=\"\",\"\",INDEX(INDIRECT(INDEX(Calcs!$D:$D,MATCH($B$3,Calcs!$A:$A,0))),6,6))","v":{"v":0.065,"d":"6.5%"}},"and",{"$f":"IF($B$3=\"\",\"\",INDEX(INDIRECT(INDEX(Calcs!$D:$D,MATCH($B$3,Calcs!$A:$A,0))),6,7))","v":{"v":0.085,"d":"8.5%"}},null,"Less than or equal to",{"$f":"IF($B$3=\"\",\"\",INDEX(INDIRECT(INDEX(Calcs!$D:$D,MATCH($B$3,Calcs!$A:$A,0))),6,6))","v":{"v":0.065,"d":"6.5%"}}]
[]
[]
[null,"Spend on teaching resources as a percentage of total expenditure",null,"Less than or equal to",{"$f":"IF($B$3=\"\",\"\",INDEX(INDIRECT(INDEX(Calcs!$D:$D,MATCH($B$3,Calcs!$A:$A,0))),7,1))","v":{"v":0.045,"d":"4.5%"}},null,"Between",{"$f":"IF($B$3=\"\",\"\",INDEX(INDIRECT(INDEX(Calcs!$D:$D,MATCH($B$3,Calcs!$A:$A,0))),7,1))","v":{"v":0.045,"d":"4.5%"}},"and",{"$f":"IF($B$3=\"\",\"\",INDEX(INDIRECT(INDEX(Calcs!$D:$D,MATCH($B$3,Calcs!$A:$A,0))),7,2))","v":{"v":0.055,"d":"5.5%"}},null,"Between",{"$f":"IF($B$3=\"\",\"\",INDEX(INDIRECT(INDEX(Calcs!$D:$D,MATCH($B$3,Calcs!$A:$A,0))),7,2))","v":{"v":0.055,"d":"5.5%"}},"and",{"$f":"IF($B$3=\"\",\"\",INDEX(INDIRECT(INDEX(Calcs!$D:$D,MATCH($B$3,Calcs!$A:$A,0))),7,3))","v":{"v":0.065,"d":"6.5%"}},null,"Between",{"$f":"IF($B$3=\"\",\"\",INDEX(INDIRECT(INDEX(Calcs!$D:$D,MATCH($B$3,Calcs!$A:$A,0))),7,3))","v":{"v":0.065,"d":"6.5%"}},"and",{"$f":"IF($B$3=\"\",\"\",INDEX(INDIRECT(INDEX(Calcs!$D:$D,MATCH($B$3,Calcs!$A:$A,0))),7,5))","v":{"v":0.075,"d":"7.5%"}}]
[{"$nulls":11},"Or more than",{"$f":"IF($B$3=\"\",\"\",INDEX(INDIRECT(INDEX(Calcs!$D:$D,MATCH($B$3,Calcs!$A:$A,0))),7,5))","v":{"v":0.075,"d":"7.5%"}}]
[]
[null,"Spend on energy as a percentage of total expenditure",null,"More than",{"$f":"IF($B$3=\"\",\"\",INDEX(INDIRECT(INDEX(Calcs!$D:$D,MATCH($B$3,Calcs!$A:$A,0))),8,7))","v":{"v":0.02,"d":"2.0%"}},null,"Between",{"$f":"IF($B$3=\"\",\"\",INDEX(INDIRECT(INDEX(Calcs!$D:$D,MATCH($B$3,Calcs!$A:$A,0))),8,6))","v":{"v":0.015,"d":"1.5%"}},"and",{"$f":"IF($B$3=\"\",\"\",INDEX(INDIRECT(INDEX(Calcs!$D:$D,MATCH($B$3,Calcs!$A:$A,0))),8,7))","v":{"v":0.02,"d":"2.0%"}},null,"Less than or equal to",{"$f":"IF($B$3=\"\",\"\",INDEX(INDIRECT(INDEX(Calcs!$D:$D,MATCH($B$3,Calcs!$A:$A,0))),8,6))","v":{"v":0.015,"d":"1.5%"}}]
[]
[]
[]
[null,"C. Reserves / balances as a percentage of total income"]
[]
[{"$nulls":3},"Red rating",null,null,"Amber rating",{"$nulls":4},"Light green rating",{"$nulls":4},"Dark green rating"]
[]
[null,"In-year balance as a percentage of total income",null,"Less than or equal to",{"$f":"IF($B$3=\"\",\"\",-0.05)","v":{"v":-0.05,"d":"-5.0%"}},null,"Between",{"$f":"IF($B$3=\"\",\"\",-0.05)","v":{"v":-0.05,"d":"-5.0%"}},"and",{"$f":"IF($B$3=\"\",\"\",0)","v":{"v":0,"d":"0.0%"}},null,"More than or equal to",{"$f":"IF($B$3=\"\",\"\",0)","v":{"v":0,"d":"0.0%"}}]
[]
[]
[null,"Revenue reserve as a percentage of total income",null,"Less than or equal to",{"$f":"IF($B$3=\"\",\"\",-0.05)","v":{"v":-0.05,"d":"-5.0%"}},null,"Between",{"$f":"IF($B$3=\"\",\"\",-0.05)","v":{"v":-0.05,"d":"-5.0%"}},"and",{"$f":"IF($B$3=\"\",\"\",0)","v":{"v":0,"d":"0.0%"}},null,"More than or equal to",{"$f":"IF($B$3=\"\",\"\",0)","v":{"v":0,"d":"0.0%"}}]
[]
[]
[]
[null,"D. School characteristics"]
[]
[{"$nulls":3},"Red rating",null,null,"Amber rating",{"$nulls":4},"Light green rating",{"$nulls":4},"Dark green rating"]
[]
[null,"Average teacher cost (£)",null,"Less than or equal to",{"$f":"IF($B$3=\"\",\"\",INDEX(INDIRECT(INDEX(Calcs!$D:$D,MATCH($B$3,Calcs!$A:$A,0))),13,1))","v":{"v":51000,"d":"£51,000"}},null,"Between",{"$f":"IF($B$3=\"\",\"\",INDEX(INDIRECT(INDEX(Calcs!$D:$D,MATCH($B$3,Calcs!$A:$A,0))),13,1))","v":{"v":51000,"d":"£51,000"}},"and",{"$f":"IF($B$3=\"\",\"\",INDEX(INDIRECT(INDEX(Calcs!$D:$D,MATCH($B$3,Calcs!$A:$A,0))),13,2))","v":{"v":53500,"d":"£53,500"}},null,"Between",{"$f":"IF($B$3=\"\",\"\",INDEX(INDIRECT(INDEX(Calcs!$D:$D,MATCH($B$3,Calcs!$A:$A,0))),13,2))","v":{"v":53500,"d":"£53,500"}},"and",{"$f":"IF($B$3=\"\",\"\",INDEX(INDIRECT(INDEX(Calcs!$D:$D,MATCH($B$3,Calcs!$A:$A,0))),13,3))","v":{"v":56000,"d":"£56,000"}},null,"Between",{"$f":"IF($B$3=\"\",\"\",INDEX(INDIRECT(INDEX(Calcs!$D:$D,MATCH($B$3,Calcs!$A:$A,0))),13,3))","v":{"v":56000,"d":"£56,000"}},"and",{"$f":"IF($B$3=\"\",\"\",INDEX(INDIRECT(INDEX(Calcs!$D:$D,MATCH($B$3,Calcs!$A:$A,0))),13,5))","v":{"v":58000,"d":"£58,000"}}]
[{"$nulls":3},"Or more than ",{"$f":"IF($B$3=\"\",\"\",INDEX(INDIRECT(INDEX(Calcs!$D:$D,MATCH($B$3,Calcs!$A:$A,0))),13,7))","v":{"v":62500,"d":"£62,500"}},null,"Or between",{"$f":"IF($B$3=\"\",\"\",INDEX(INDIRECT(INDEX(Calcs!$D:$D,MATCH($B$3,Calcs!$A:$A,0))),13,6))","v":{"v":60500,"d":"£60,500"}},"and",{"$f":"IF($B$3=\"\",\"\",INDEX(INDIRECT(INDEX(Calcs!$D:$D,MATCH($B$3,Calcs!$A:$A,0))),13,7))","v":{"v":62500,"d":"£62,500"}},null,"Or between",{"$f":"IF($B$3=\"\",\"\",INDEX(INDIRECT(INDEX(Calcs!$D:$D,MATCH($B$3,Calcs!$A:$A,0))),13,5))","v":{"v":58000,"d":"£58,000"}},"and",{"$f":"IF($B$3=\"\",\"\",INDEX(INDIRECT(INDEX(Calcs!$D:$D,MATCH($B$3,Calcs!$A:$A,0))),13,6))","v":{"v":60500,"d":"£60,500"}}]
[]
[null,"Senior leaders as a percentage of workforce",null,"More than",{"$f":"IF($B$3=\"\",\"\",INDEX(INDIRECT(INDEX(Calcs!$D:$D,MATCH($B$3,Calcs!$A:$A,0))),9,7))","v":{"v":0.08,"d":"8.0%"}},null,"Between",{"$f":"IF($B$3=\"\",\"\",INDEX(INDIRECT(INDEX(Calcs!$D:$D,MATCH($B$3,Calcs!$A:$A,0))),9,6))","v":{"v":0.07,"d":"7.0%"}},"and",{"$f":"IF($B$3=\"\",\"\",INDEX(INDIRECT(INDEX(Calcs!$D:$D,MATCH($B$3,Calcs!$A:$A,0))),9,7))","v":{"v":0.08,"d":"8.0%"}},null,"Between",{"$f":"IF($B$3=\"\",\"\",INDEX(INDIRECT(INDEX(Calcs!$D:$D,MATCH($B$3,Calcs!$A:$A,0))),9,5))","v":{"v":0.06,"d":"6.0%"}},"and",{"$f":"IF($B$3=\"\",\"\",INDEX(INDIRECT(INDEX(Calcs!$D:$D,MATCH($B$3,Calcs!$A:$A,0))),9,6))","v":{"v":0.07,"d":"7.0%"}},null,"Between",{"$f":"IF($B$3=\"\",\"\",INDEX(INDIRECT(INDEX(Calcs!$D:$D,MATCH($B$3,Calcs!$A:$A,0))),9,3))","v":{"v":0.05,"d":"5.0%"}},"and",{"$f":"IF($B$3=\"\",\"\",INDEX(INDIRECT(INDEX(Calcs!$D:$D,MATCH($B$3,Calcs!$A:$A,0))),9,5))","v":{"v":0.06,"d":"6.0%"}}]
[{"$nulls":11},"Or less than or equal to",{"$f":"IF($B$3=\"\",\"\",INDEX(INDIRECT(INDEX(Calcs!$D:$D,MATCH($B$3,Calcs!$A:$A,0))),9,3))","v":{"v":0.05,"d":"5.0%"}}]
[]
[null,"Pupil to teacher ratio",null,"Less than or equal to",{"$f":"IF($B$3=\"\",\"\",INDEX(INDIRECT(INDEX(Calcs!$D:$D,MATCH($B$3,Calcs!$A:$A,0))),10,1))","v":{"v":14,"d":"14.0"}},null,"Between",{"$f":"IF($B$3=\"\",\"\",INDEX(INDIRECT(INDEX(Calcs!$D:$D,MATCH($B$3,Calcs!$A:$A,0))),10,1))","v":{"v":14,"d":"14.0"}},"and",{"$f":"IF($B$3=\"\",\"\",INDEX(INDIRECT(INDEX(Calcs!$D:$D,MATCH($B$3,Calcs!$A:$A,0))),10,2))","v":{"v":15,"d":"15.0"}},null,"Between",{"$f":"IF($B$3=\"\",\"\",INDEX(INDIRECT(INDEX(Calcs!$D:$D,MATCH($B$3,Calcs!$A:$A,0))),10,2))","v":{"v":15,"d":"15.0"}},"and",{"$f":"IF($B$3=\"\",\"\",INDEX(INDIRECT(INDEX(Calcs!$D:$D,MATCH($B$3,Calcs!$A:$A,0))),10,3))","v":{"v":16,"d":"16.0"}},null,"Between",{"$f":"IF($B$3=\"\",\"\",INDEX(INDIRECT(INDEX(Calcs!$D:$D,MATCH($B$3,Calcs!$A:$A,0))),10,3))","v":{"v":16,"d":"16.0"}},"and",{"$f":"IF($B$3=\"\",\"\",INDEX(INDIRECT(INDEX(Calcs!$D:$D,MATCH($B$3,Calcs!$A:$A,0))),10,5))","v":16.5}]
[{"$nulls":3},"Or more than ",{"$f":"IF($B$3=\"\",\"\",INDEX(INDIRECT(INDEX(Calcs!$D:$D,MATCH($B$3,Calcs!$A:$A,0))),10,7))","v":18.5},null,"Or between",{"$f":"IF($B$3=\"\",\"\",INDEX(INDIRECT(INDEX(Calcs!$D:$D,MATCH($B$3,Calcs!$A:$A,0))),10,6))","v":17.5},"and",{"$f":"IF($B$3=\"\",\"\",INDEX(INDIRECT(INDEX(Calcs!$D:$D,MATCH($B$3,Calcs!$A:$A,0))),10,7))","v":18.5},null,"Or between",{"$f":"IF($B$3=\"\",\"\",INDEX(INDIRECT(INDEX(Calcs!$D:$D,MATCH($B$3,Calcs!$A:$A,0))),10,5))","v":16.5},"and",{"$f":"IF($B$3=\"\",\"\",INDEX(INDIRECT(INDEX(Calcs!$D:$D,MATCH($B$3,Calcs!$A:$A,0))),10,6))","v":17.5}]
[]
[null,"Pupil to adult ratio",null,"Less than or equal to",{"$f":"IF($B$3=\"\",\"\",INDEX(INDIRECT(INDEX(Calcs!$D:$D,MATCH($B$3,Calcs!$A:$A,0))),11,1))","v":8.5},null,"Between",{"$f":"IF($B$3=\"\",\"\",INDEX(INDIRECT(INDEX(Calcs!$D:$D,MATCH($B$3,Calcs!$A:$A,0))),11,1))","v":8.5},"and",{"$f":"IF($B$3=\"\",\"\",INDEX(INDIRECT(INDEX(Calcs!$D:$D,MATCH($B$3,Calcs!$A:$A,0))),11,2))","v":{"v":9,"d":"9.0"}},null,"Between",{"$f":"IF($B$3=\"\",\"\",INDEX(INDIRECT(INDEX(Calcs!$D:$D,MATCH($B$3,Calcs!$A:$A,0))),11,2))","v":{"v":9,"d":"9.0"}},"and",{"$f":"IF($B$3=\"\",\"\",INDEX(INDIRECT(INDEX(Calcs!$D:$D,MATCH($B$3,Calcs!$A:$A,0))),11,3))","v":9.5},null,"Between",{"$f":"IF($B$3=\"\",\"\",INDEX(INDIRECT(INDEX(Calcs!$D:$D,MATCH($B$3,Calcs!$A:$A,0))),11,3))","v":9.5},"and",{"$f":"IF($B$3=\"\",\"\",INDEX(INDIRECT(INDEX(Calcs!$D:$D,MATCH($B$3,Calcs!$A:$A,0))),11,5))","v":{"v":10,"d":"10.0"}}]
[{"$nulls":3},"Or more than ",{"$f":"IF($B$3=\"\",\"\",INDEX(INDIRECT(INDEX(Calcs!$D:$D,MATCH($B$3,Calcs!$A:$A,0))),11,7))","v":11.5},null,"Or between",{"$f":"IF($B$3=\"\",\"\",INDEX(INDIRECT(INDEX(Calcs!$D:$D,MATCH($B$3,Calcs!$A:$A,0))),11,6))","v":{"v":11,"d":"11.0"}},"and",{"$f":"IF($B$3=\"\",\"\",INDEX(INDIRECT(INDEX(Calcs!$D:$D,MATCH($B$3,Calcs!$A:$A,0))),11,7))","v":11.5},null,"Or between",{"$f":"IF($B$3=\"\",\"\",INDEX(INDIRECT(INDEX(Calcs!$D:$D,MATCH($B$3,Calcs!$A:$A,0))),11,5))","v":{"v":10,"d":"10.0"}},"and",{"$f":"IF($B$3=\"\",\"\",INDEX(INDIRECT(INDEX(Calcs!$D:$D,MATCH($B$3,Calcs!$A:$A,0))),11,6))","v":{"v":11,"d":"11.0"}}]
[]
[null,{"$f":"IF(OR($B$7=\"- an alternative provision school\",$B$7=\"- a special school\",$B$7=\"- a nursery school\"),\"\",\"Teacher contact ratio (less than 1.0)\")","v":"Teacher contact ratio (less than 1.0)"},null,{"$f":"IF(B71=\"\",\"\",\"Less than or equal to\")","v":"Less than or equal to"},{"$f":"IF(OR($B$7=\"- an alternative provision school\",$B$7=\"- a special school\",$B$7=\"- a nursery school\",$B$3=\"\"),\"\",0.7)","v":{"v":0.7,"d":"0.70"}},null,{"$f":"IF(B71=\"\",\"\",\"Between\")","v":"Between"},{"$f":"IF(OR($B$7=\"- an alternative provision school\",$B$7=\"- a special school\",$B$7=\"- a nursery school\",$B$3=\"\"),\"\",0.7)","v":{"v":0.7,"d":"0.70"}},{"$f":"IF(B71=\"\",\"\",\"and\")","v":"and"},{"$f":"IF(OR($B$7=\"- an alternative provision school\",$B$7=\"- a special school\",$B$7=\"- a nursery school\",$B$3=\"\"),\"\",0.74)","v":0.74},null,{"$f":"IF(B71=\"\",\"\",\"Between\")","v":"Between"},{"$f":"IF(OR($B$7=\"- an alternative provision school\",$B$7=\"- a special school\",$B$7=\"- a nursery school\",$B$3=\"\"),\"\",0.4)","v":{"v":0.4,"d":"0.40"}},{"$f":"IF(G71=\"\",\"\",\"and\")","v":"and"},{"$f":"IF(OR($B$7=\"- an alternative provision school\",$B$7=\"- a special school\",$B$7=\"- a nursery school\",$B$3=\"\"),\"\",0.8)","v":{"v":0.8,"d":"0.80"}}]
[{"$nulls":3},{"$f":"IF(B71=\"\",\"\",\"Or more than\")","v":"Or more than"},{"$f":"IF(OR($B$7=\"- an alternative provision school\",$B$7=\"- a special school\",$B$7=\"- a nursery school\",$B$3=\"\"),\"\",0.82)","v":0.82},null,{"$f":"IF(B71=\"\",\"\",\"Or between\")","v":"Or between"},{"$f":"IF(OR($B$7=\"- an alternative provision school\",$B$7=\"- a special school\",$B$7=\"- a nursery school\",$B$3=\"\"),\"\",0.8)","v":{"v":0.8,"d":"0.80"}},{"$f":"IF(B72=\"\",\"\",\"and\")","v":""},{"$f":"IF(OR($B$7=\"- an alternative provision school\",$B$7=\"- a special school\",$B$7=\"- a nursery school\",$B$3=\"\"),\"\",0.82)","v":0.82}]
[]
[null,"Predicted percentage pupil number change in 3-5 years",null,"Less than or equal to",{"$f":"IF($B$3=\"\",\"\",-0.1)","v":{"v":-0.1,"d":"-10.0%"}},null,"Between",{"$f":"IF($B$3=\"\",\"\",-0.1)","v":{"v":-0.1,"d":"-10.0%"}},"and",{"$f":"IF($B$3=\"\",\"\",-0.02)","v":{"v":-0.02,"d":"-2.0%"}},null,"More than",{"$f":"IF($B$3=\"\",\"\",-0.02)","v":{"v":-0.02,"d":"-2.0%"}}]
[]
[]
[null,{"$f":"IF(OR($B$7=\"- an alternative provision school\",$B$7=\"- a special school\",$B$7=\"- a nursery school\"),\"\",\"Average class size\")","v":"Average class size"},null,{"$f":"IF(B77=\"\",\"\",\"Less than or equal to\")","v":"Less than or equal to"},{"$f":"IF($B$3=\"\",\"\",INDEX(INDIRECT(INDEX(Calcs!$D:$D,MATCH($B$3,Calcs!$A:$A,0))),12,1))","v":{"v":19,"d":"19.0"}},null,{"$f":"IF(B77=\"\",\"\",\"Between\")","v":"Between"},{"$f":"IF($B$3=\"\",\"\",INDEX(INDIRECT(INDEX(Calcs!$D:$D,MATCH($B$3,Calcs!$A:$A,0))),12,1))","v":{"v":19,"d":"19.0"}},{"$f":"IF(B77=\"\",\"\",\"and\")","v":"and"},{"$f":"IF($B$3=\"\",\"\",INDEX(INDIRECT(INDEX(Calcs!$D:$D,MATCH($B$3,Calcs!$A:$A,0))),12,2))","v":19.5},null,{"$f":"IF(B77=\"\",\"\",\"Between\")","v":"Between"},{"$f":"IF($B$3=\"\",\"\",INDEX(INDIRECT(INDEX(Calcs!$D:$D,MATCH($B$3,Calcs!$A:$A,0))),12,2))","v":19.5},{"$f":"IF(B77=\"\",\"\",\"and\")","v":"and"},{"$f":"IF($B$3=\"\",\"\",INDEX(INDIRECT(INDEX(Calcs!$D:$D,MATCH($B$3,Calcs!$A:$A,0))),12,3))","v":20.5},null,{"$f":"IF(B77=\"\",\"\",\"Between\")","v":"Between"},{"$f":"IF($B$3=\"\",\"\",INDEX(INDIRECT(INDEX(Calcs!$D:$D,MATCH($B$3,Calcs!$A:$A,0))),12,3))","v":20.5},{"$f":"IF(B77=\"\",\"\",\"and\")","v":"and"},{"$f":"IF($B$3=\"\",\"\",INDEX(INDIRECT(INDEX(Calcs!$D:$D,MATCH($B$3,Calcs!$A:$A,0))),12,5))","v":21.5}]
[{"$nulls":3},{"$f":"IF(B77=\"\",\"\",\"Or more than\")","v":"Or more than"},{"$f":"IF($B$3=\"\",\"\",INDEX(INDIRECT(INDEX(Calcs!$D:$D,MATCH($B$3,Calcs!$A:$A,0))),12,7))","v":{"v":23,"d":"23.0"}},null,{"$f":"IF(B77=\"\",\"\",\"Or between\")","v":"Or between"},{"$f":"IF($B$3=\"\",\"\",INDEX(INDIRECT(INDEX(Calcs!$D:$D,MATCH($B$3,Calcs!$A:$A,0))),12,6))","v":{"v":22,"d":"22.0"}},{"$f":"IF(B77=\"\",\"\",\"and\")","v":"and"},{"$f":"IF($B$3=\"\",\"\",INDEX(INDIRECT(INDEX(Calcs!$D:$D,MATCH($B$3,Calcs!$A:$A,0))),12,7))","v":{"v":23,"d":"23.0"}},null,{"$f":"IF(B77=\"\",\"\",\"Or between\")","v":"Or between"},{"$f":"IF($B$3=\"\",\"\",INDEX(INDIRECT(INDEX(Calcs!$D:$D,MATCH($B$3,Calcs!$A:$A,0))),12,5))","v":21.5},{"$f":"IF(B77=\"\",\"\",\"and\")","v":"and"},{"$f":"IF($B$3=\"\",\"\",INDEX(INDIRECT(INDEX(Calcs!$D:$D,MATCH($B$3,Calcs!$A:$A,0))),12,6))","v":{"v":22,"d":"22.0"}}]
[]
[]
[null,"E. Outcomes"]
[]
[{"$nulls":3},"Red rating",null,null,"Amber rating",{"$nulls":4},"Light green rating",{"$nulls":4},"Dark green rating"]
[]
[null,"Ofsted rating",null,"School is rated",null,null,"School is rated",{"$nulls":4},"School is rated",{"$nulls":4},"School is rated"]
[{"$nulls":3},{"$f":"IF($B$3=\"\",\"\",\"Inadequate\")","v":"Inadequate"},null,null,{"$f":"IF($B$3=\"\",\"\",\"Requires Improvement (RI)\")","v":"Requires Improvement (RI)"},{"$nulls":4},{"$f":"IF($B$3=\"\",\"\",\"Good\")","v":"Good"},{"$nulls":4},{"$f":"IF($B$3=\"\",\"\",\"Outstanding\")","v":"Outstanding"}]
[]
[null,{"$f":"IF(OR($B$7=\"- a primary school\",$B$7=\"- a nursery school\"),\"\",\"Progress 8 score\")","v":"Progress 8 score"},null,{"$f":"IF(B88=\"\",\"\",\"Less than or equal to\")","v":"Less than or equal to"},{"$f":"IF(OR($B$3=\"\",B88=\"\"),\"\",-0.5)","v":-0.5},null,{"$f":"IF(B88=\"\",\"\",\"Between\")","v":"Between"},{"$f":"IF(OR($B$3=\"\",B88=\"\"),\"\",-0.5)","v":-0.5},{"$f":"IF(B88=\"\",\"\",\"and\")","v":"and"},{"$f":"IF(OR($B$3=\"\",B88=\"\"),\"\",0)","v":0},null,{"$f":"IF(B88=\"\",\"\",\"Between\")","v":"Between"},{"$f":"IF(OR($B$3=\"\",B88=\"\"),\"\",0)","v":0},{"$f":"IF(B88=\"\",\"\",\"and\")","v":"and"},{"$f":"IF(OR($B$3=\"\",B88=\"\"),\"\",0.5)","v":0.5},null,{"$f":"IF(B88=\"\",\"\",\"More than\")","v":"More than"},{"$f":"IF(OR($B$3=\"\",B88=\"\"),\"\",0.5)","v":0.5}]
[]
[]
[null,{"$f":"IF(OR($B$7=\"- a secondary school with a sixth form\", $B$7=\"- a secondary school without a sixth form\",$B$7=\"- a nursery school\"),\"\",\"Progress score in reading\")","v":""},null,{"$f":"IF(B91=\"\",\"\",\"Less than or equal to\")","v":""},{"$f":"IF(OR($B$3=\"\",B91=\"\"),\"\",-2.7)","v":""},null,{"$f":"IF(B91=\"\",\"\",\"Between\")","v":""},{"$f":"IF(OR($B$3=\"\",B91=\"\"),\"\",-2.7)","v":""},{"$f":"IF(B91=\"\",\"\",\"and\")","v":""},{"$f":"IF(OR($B$3=\"\",B91=\"\"),\"\",0)","v":""},null,{"$f":"IF(B91=\"\",\"\",\"Between\")","v":""},{"$f":"IF(OR($B$3=\"\",B91=\"\"),\"\",0)","v":""},{"$f":"IF(B91=\"\",\"\",\"and\")","v":""},{"$f":"IF(OR($B$3=\"\",B91=\"\"),\"\",3.2)","v":""},null,{"$f":"IF(B91=\"\",\"\",\"More than\")","v":""},{"$f":"IF(OR($B$3=\"\",B91=\"\"),\"\",3.2)","v":""}]
[]
[]
[null,{"$f":"IF(OR($B$7=\"- a secondary school with a sixth form\", $B$7=\"- a secondary school without a sixth form\",$B$7=\"- a nursery school\"),\"\",\"Progress score in writing\")","v":""},null,{"$f":"IF(B94=\"\",\"\",\"Less than or equal to\")","v":""},{"$f":"IF(OR($B$3=\"\",B94=\"\"),\"\",-2.6)","v":""},null,{"$f":"IF(B94=\"\",\"\",\"Between\")","v":""},{"$f":"IF(OR($B$3=\"\",B94=\"\"),\"\",-2.6)","v":""},{"$f":"IF(B94=\"\",\"\",\"and\")","v":""},{"$f":"IF(OR($B$3=\"\",B94=\"\"),\"\",0)","v":""},null,{"$f":"IF(B94=\"\",\"\",\"Between\")","v":""},{"$f":"IF(OR($B$3=\"\",B94=\"\"),\"\",0)","v":""},{"$f":"IF(B94=\"\",\"\",\"and\")","v":""},{"$f":"IF(OR($B$3=\"\",B94=\"\"),\"\",2.7)","v":""},null,{"$f":"IF(B94=\"\",\"\",\"More than\")","v":""},{"$f":"IF(OR($B$3=\"\",B94=\"\"),\"\",2.7)","v":""}]
[]
[]
[null,{"$f":"IF(OR($B$7=\"- a secondary school with a sixth form\", $B$7=\"- a secondary school without a sixth form\",$B$7=\"- a nursery school\"),\"\",\"Progress score in maths\")","v":""},null,{"$f":"IF(B97=\"\",\"\",\"Less than or equal to\")","v":""},{"$f":"IF(OR($B$3=\"\",B97=\"\"),\"\",-3.1)","v":""},null,{"$f":"IF(B97=\"\",\"\",\"Between\")","v":""},{"$f":"IF(OR($B$3=\"\",B97=\"\"),\"\",-3.1)","v":""},{"$f":"IF(B97=\"\",\"\",\"and\")","v":""},{"$f":"IF(OR($B$3=\"\",B97=\"\"),\"\",0)","v":""},null,{"$f":"IF(B97=\"\",\"\",\"Between\")","v":""},{"$f":"IF(OR($B$3=\"\",B97=\"\"),\"\",0)","v":""},{"$f":"IF(B97=\"\",\"\",\"and\")","v":""},{"$f":"IF(OR($B$3=\"\",B97=\"\"),\"\",3.2)","v":""},null,{"$f":"IF(B97=\"\",\"\",\"More than\")","v":""},{"$f":"IF(OR($B$3=\"\",B97=\"\"),\"\",3.2)","v":""}]

{"sheet":"RAG rating data for all schools","index":5,"n_rows":559,"n_cols":14,"rows_kept":559,"merged":[[426,3,426,4],[541,3,541,4]]}
[null,"Expand the groups to see the thresholds"]
[]
["Sample size","Phase","Size","FSM",null,"Red if less than:","Amber if less than:","Dark green if between:","(Median)","and:","Amber if more than:","Red if more than:",null,"Light green for everything else"]
[726,"Primary","Very small","Low FSM","PVSL"]
[null,"Primary","Very small","Low FSM","Spend on teaching staff as a percentage of total expenditure",{"v":0.395,"d":"39.5%"},{"v":0.42,"d":"42.0%"},{"v":0.455,"d":"45.5%"},{"v":0.47,"d":"47.0%"},{"v":0.485,"d":"48.5%"},{"v":0.515,"d":"51.5%"},{"v":0.54,"d":"54.0%"}]
[null,"Primary","Very small","Low FSM","Spend on supply staff as a percentage of total expenditure",null,null,{"v":0.02,"d":"2.0%"},{"v":0.02,"d":"2.0%"},{"v":0.025,"d":"2.5%"},{"v":0.04,"d":"4.0%"},{"v":0.055,"d":"5.5%"}]
[null,"Primary","Very small","Low FSM","Spend on education support staff as a percentage of total expenditure",null,null,{"v":0.125,"d":"12.5%"},{"v":0.13,"d":"13.0%"},{"v":0.145,"d":"14.5%"},{"v":0.17,"d":"17.0%"},{"v":0.19,"d":"19.0%"}]
[null,"Primary","Very small","Low FSM","Spend on administrative and clerical staff as a percentage of total expenditure",{"$nulls":3},{"v":0.055,"d":"5.5%"},null,{"v":0.075,"d":"7.5%"},{"v":0.085,"d":"8.5%"}]
[null,"Primary","Very small","Low FSM","Spend on other staff costs as a percentage of total expenditure",{"$nulls":3},{"v":0.03,"d":"3.0%"},null,{"v":0.05,"d":"5.0%"},{"v":0.06,"d":"6.0%"}]
[null,"Primary","Very small","Low FSM","Spend on premises (including staff costs) as a percentage of total expenditure",{"$nulls":3},{"v":0.05,"d":"5.0%"},null,{"v":0.065,"d":"6.5%"},{"v":0.08,"d":"8.0%"}]
[null,"Primary","Very small","Low FSM","Spend on teaching resources as a percentage of total expenditure",{"v":0.03,"d":"3.0%"},{"v":0.04,"d":"4.0%"},{"v":0.05,"d":"5.0%"},{"v":0.055,"d":"5.5%"},{"v":0.065,"d":"6.5%"}]
[null,"Primary","Very small","Low FSM","Spend on energy as a percentage of total expenditure",{"$nulls":3},{"v":0.01,"d":"1.0%"},null,{"v":0.015,"d":"1.5%"},{"v":0.02,"d":"2.0%"}]
[null,"Primary","Very small","Low FSM","Senior leaders as a percentage of workforce",null,null,{"v":0.115,"d":"11.5%"},{"v":0.125,"d":"12.5%"},{"v":0.14,"d":"14.0%"},{"v":0.175,"d":"17.5%"},{"v":0.21,"d":"21.0%"}]
[null,"Primary","Very small","Low FSM","Pupil to teacher ratio",{"v":12,"d":"12.0"},{"v":14,"d":"14.0"},{"v":16,"d":"16.0"},{"v":17,"d":"17.0"},{"v":18,"d":"18.0"},{"v":20,"d":"20.0"},22.5]
[null,"Primary","Very small","Low FSM","Pupil to adult ratio",{"v":6,"d":"6.0"},{"v":7,"d":"7.0"},{"v":8,"d":"8.0"},8.5,{"v":9,"d":"9.0"},{"v":10,"d":"10.0"},{"v":11,"d":"11.0"}]
[null,"Primary","Very small","Low FSM","Average class size",14.5,{"v":17,"d":"17.0"},20.5,{"v":21,"d":"21.0"},22.5,24.5,{"v":26,"d":"26.0"}]
[]
[698,"Primary","Small","Low FSM","PSL"]
[null,"Primary","Small","Low FSM","Spend on teaching staff as a percentage of total expenditure",{"v":0.405,"d":"40.5%"},{"v":0.43,"d":"43.0%"},{"v":0.46,"d":"46.0%"},{"v":0.47,"d":"47.0%"},{"v":0.48,"d":"48.0%"},{"v":0.515,"d":"51.5%"},{"v":0.535,"d":"53.5%"}]
[null,"Primary","Small","Low FSM","Spend on supply staff as a percentage of total expenditure",null,null,{"v":0.02,"d":"2.0%"},{"v":0.02,"d":"2.0%"},{"v":0.025,"d":"2.5%"},{"v":0.04,"d":"4.0%"},{"v":0.055,"d":"5.5%"}]
[null,"Primary","Small","Low FSM","Spend on education support staff as a percentage of total expenditure",null,null,{"v":0.135,"d":"13.5%"},{"v":0.145,"d":"14.5%"},{"v":0.155,"d":"15.5%"},{"v":0.175,"d":"17.5%"},{"v":0.195,"d":"19.5%"}]
[null,"Primary","Small","Low FSM","Spend on administrative and clerical staff as a percentage of total expenditure",{"$nulls":3},{"v":0.05,"d":"5.0%"},null,{"v":0.065,"d":"6.5%"},{"v":0.075,"d":"7.5%"}]
[null,"Primary","Small","Low FSM","Spend on other staff costs as a percentage of total expenditure",{"$nulls":3},{"v":0.03,"d":"3.0%"},null,{"v":0.05,"d":"5.0%"},{"v":0.065,"d":"6.5%"}]
[null,"Primary","Small","Low FSM","Spend on premises (including staff costs) as a percentage of total expenditure",{"$nulls":3},{"v":0.05,"d":"5.0%"},null,{"v":0.06,"d":"6.0%"},{"v":0.07,"d":"7.0%"}]
[null,"Primary","Small","Low FSM","Spend on teaching resources as a percentage of total expenditure",{"v":0.03,"d":"3.0%"},{"v":0.04,"d":"4.0%"},{"v":0.05,"d":"5.0%"},{"v":0.055,"d":"5.5%"},{"v":0.06,"d":"6.0%"}]
[null,"Primary","Small","Low FSM","Spend on energy as a percentage of total expenditure",{"$nulls":3},{"v":0.01,"d":"1.0%"},null,{"v":0.015,"d":"1.5%"},{"v":0.02,"d":"2.0%"}]
[null,"Primary","Small","Low FSM","Senior leaders as a percentage of workforce",null,null,{"v":0.1,"d":"10.0%"},{"v":0.115,"d":"11.5%"},{"v":0.125,"d":"12.5%"},{"v":0.155,"d":"15.5%"},{"v":0.18,"d":"18.0%"}]
[null,"Primary","Small","Low FSM","Pupil to teacher ratio",{"v":17,"d":"17.0"},18.5,19.5,20.5,{"v":21,"d":"21.0"},22.5,{"v":24,"d":"24.0"}]
[null,"Primary","Small","Low FSM","Pupil to adult ratio",{"v":8,"d":"8.0"},8.5,{"v":9,"d":"9.0"},9.5,{"v":10,"d":"10.0"},{"v":11,"d":"11.0"},{"v":12,"d":"12.0"}]
[null,"Primary","Small","Low FSM","Average class size",21.5,{"v":23,"d":"23.0"},{"v":25,"d":"25.0"},{"v":26,"d":"26.0"},26.5,{"v":28,"d":"28.0"},{"v":29,"d":"29.0"}]
[]
[{"v":1757,"d":"1,757"},"Primary","Medium","Low FSM","PML"]
[null,"Primary","Medium","Low FSM","Spend on teaching staff as a percentage of total expenditure",{"v":0.405,"d":"40.5%"},{"v":0.425,"d":"42.5%"},{"v":0.455,"d":"45.5%"},{"v":0.465,"d":"46.5%"},{"v":0.48,"d":"48.0%"},{"v":0.505,"d":"50.5%"},{"v":0.525,"d":"52.5%"}]
[null,"Primary","Medium","Low FSM","Spend on supply staff as a percentage of total expenditure",null,null,{"v":0.02,"d":"2.0%"},{"v":0.02,"d":"2.0%"},{"v":0.025,"d":"2.5%"},{"v":0.04,"d":"4.0%"},{"v":0.05,"d":"5.0%"}]
[null,"Primary","Medium","Low FSM","Spend on education support staff as a percentage of total expenditure",null,null,{"v":0.145,"d":"14.5%"},{"v":0.155,"d":"15.5%"},{"v":0.165,"d":"16.5%"},{"v":0.19,"d":"19.0%"},{"v":0.21,"d":"21.0%"}]
[null,"Primary","Medium","Low FSM","Spend on administrative and clerical staff as a percentage of total expenditure",{"$nulls":3},{"v":0.05,"d":"5.0%"},null,{"v":0.06,"d":"6.0%"},{"v":0.07,"d":"7.0%"}]
[null,"Primary","Medium","Low FSM","Spend on other staff costs as a percentage of total expenditure",{"$nulls":3},{"v":0.035,"d":"3.5%"},null,{"v":0.05,"d":"5.0%"},{"v":0.065,"d":"6.5%"}]
[null,"Primary","Medium","Low FSM","Spend on premises (including staff costs) as a percentage of total expenditure",{"$nulls":3},{"v":0.05,"d":"5.0%"},null,{"v":0.065,"d":"6.5%"},{"v":0.075,"d":"7.5%"}]
[null,"Primary","Medium","Low FSM","Spend on teaching resources as a percentage of total expenditure",{"v":0.03,"d":"3.0%"},{"v":0.04,"d":"4.0%"},{"v":0.05,"d":"5.0%"},{"v":0.055,"d":"5.5%"},{"v":0.06,"d":"6.0%"}]
[null,"Primary","Medium","Low FSM","Spend on energy as a percentage of total expenditure",{"$nulls":3},{"v":0.01,"d":"1.0%"},null,{"v":0.015,"d":"1.5%"},{"v":0.02,"d":"2.0%"}]
[null,"Primary","Medium","Low FSM","Senior leaders as a percentage of workforce",null,null,{"v":0.09,"d":"9.0%"},{"v":0.095,"d":"9.5%"},{"v":0.1,"d":"10.0%"},{"v":0.115,"d":"11.5%"},{"v":0.135,"d":"13.5%"}]
[null,"Primary","Medium","Low FSM","Pupil to teacher ratio",19.5,20.5,{"v":22,"d":"22.0"},22.5,{"v":23,"d":"23.0"},24.5,{"v":26,"d":"26.0"}]
[null,"Primary","Medium","Low FSM","Pupil to adult ratio",8.5,9.5,{"v":10,"d":"10.0"},10.5,{"v":11,"d":"11.0"},{"v":12,"d":"12.0"},12.5]
[null,"Primary","Medium","Low FSM","Average class size",{"v":26,"d":"26.0"},{"v":27,"d":"27.0"},28.5,{"v":29,"d":"29.0"},29.5,{"v":30,"d":"30.0"},30.5]
[]
[650,"Primary","Large","Low FSM","PLL"]
[null,"Primary","Large","Low FSM","Spend on teaching staff as a percentage of total expenditure",{"v":0.42,"d":"42.0%"},{"v":0.445,"d":"44.5%"},{"v":0.47,"d":"47.0%"},{"v":0.48,"d":"48.0%"},{"v":0.49,"d":"49.0%"},{"v":0.51,"d":"51.0%"},{"v":0.53,"d":"53.0%"}]
[null,"Primary","Large","Low FSM","Spend on supply staff as a percentage of total expenditure",null,null,{"v":0.015,"d":"1.5%"},{"v":0.02,"d":"2.0%"},{"v":0.025,"d":"2.5%"},{"v":0.035,"d":"3.5%"},{"v":0.05,"d":"5.0%"}]
[null,"Primary","Large","Low FSM","Spend on education support staff as a percentage of total expenditure",null,null,{"v":0.155,"d":"15.5%"},{"v":0.16,"d":"16.0%"},{"v":0.17,"d":"17.0%"},{"v":0.195,"d":"19.5%"},{"v":0.21,"d":"21.0%"}]
[null,"Primary","Large","Low FSM","Spend on administrative and clerical staff as a percentage of total expenditure",{"$nulls":3},{"v":0.045,"d":"4.5%"},null,{"v":0.06,"d":"6.0%"},{"v":0.07,"d":"7.0%"}]
[null,"Primary","Large","Low FSM","Spend on other staff costs as a percentage of total expenditure",{"$nulls":3},{"v":0.035,"d":"3.5%"},null,{"v":0.05,"d":"5.0%"},{"v":0.06,"d":"6.0%"}]
[null,"Primary","Large","Low FSM","Spend on premises (including staff costs) as a percentage of total expenditure",{"$nulls":3},{"v":0.05,"d":"5.0%"},null,{"v":0.06,"d":"6.0%"},{"v":0.07,"d":"7.0%"}]
[null,"Primary","Large","Low FSM","Spend on teaching resources as a percentage of total expenditure",{"v":0.03,"d":"3.0%"},{"v":0.04,"d":"4.0%"},{"v":0.045,"d":"4.5%"},{"v":0.05,"d":"5.0%"},{"v":0.055,"d":"5.5%"}]
[null,"Primary","Large","Low FSM","Spend on energy as a percentage of total expenditure",{"$nulls":3},{"v":0.01,"d":"1.0%"},null,{"v":0.015,"d":"1.5%"},{"v":0.02,"d":"2.0%"}]
[null,"Primary","Large","Low FSM","Senior leaders as a percentage of workforce",null,null,{"v":0.06,"d":"6.0%"},{"v":0.07,"d":"7.0%"},{"v":0.075,"d":"7.5%"},{"v":0.09,"d":"9.0%"},{"v":0.1,"d":"10.0%"}]
[null,"Primary","Large","Low FSM","Pupil to teacher ratio",20.5,21.5,22.5,{"v":23,"d":"23.0"},{"v":24,"d":"24.0"},{"v":25,"d":"25.0"},26.5]
[null,"Primary","Large","Low FSM","Pupil to adult ratio",9.5,{"v":10,"d":"10.0"},{"v":11,"d":"11.0"},{"v":11,"d":"11.0"},11.5,12.5,{"v":13,"d":"13.0"}]
[null,"Primary","Large","Low FSM","Average class size",{"v":28,"d":"28.0"},28.5,{"v":29,"d":"29.0"},29.5,29.5,{"v":30,"d":"30.0"},30.5]
[]
[880,"Primary","Very small","Medium FSM","PVSM"]
[null,"Primary","Very small","Medium FSM","Spend on teaching staff as a percentage of total expenditure",{"v":0.38,"d":"38.0%"},{"v":0.415,"d":"41.5%"},{"v":0.445,"d":"44.5%"},{"v":0.455,"d":"45.5%"},{"v":0.475,"d":"47.5%"},{"v":0.51,"d":"51.0%"},{"v":0.535,"d":"53.5%"}]
[null,"Primary","Very small","Medium FSM","Spend on supply staff as a percentage of total expenditure",null,null,{"v":0.02,"d":"2.0%"},{"v":0.025,"d":"2.5%"},{"v":0.03,"d":"3.0%"},{"v":0.045,"d":"4.5%"},{"v":0.065,"d":"6.5%"}]
[null,"Primary","Very small","Medium FSM","Spend on education support staff as a percentage of total expenditure",null,null,{"v":0.13,"d":"13.0%"},{"v":0.145,"d":"14.5%"},{"v":0.155,"d":"15.5%"},{"v":0.18,"d":"18.0%"},{"v":0.2,"d":"20.0%"}]
[null,"Primary","Very small","Medium FSM","Spend on administrative and clerical staff as a percentage of total expenditure",{"$nulls":3},{"v":0.055,"d":"5.5%"},null,{"v":0.07,"d":"7.0%"},{"v":0.085,"d":"8.5%"}]
[null,"Primary","Very small","Medium FSM","Spend on other staff costs as a percentage of total expenditure",{"$nulls":3},{"v":0.035,"d":"3.5%"},null,{"v":0.05,"d":"5.0%"},{"v":0.065,"d":"6.5%"}]
[null,"Primary","Very small","Medium FSM","Spend on premises (including staff costs) as a percentage of total expenditure",{"$nulls":3},{"v":0.05,"d":"5.0%"},null,{"v":0.065,"d":"6.5%"},{"v":0.075,"d":"7.5%"}]
[null,"Primary","Very small","Medium FSM","Spend on teaching resources as a percentage of total expenditure",{"v":0.03,"d":"3.0%"},{"v":0.04,"d":"4.0%"},{"v":0.05,"d":"5.0%"},{"v":0.055,"d":"5.5%"},{"v":0.06,"d":"6.0%"}]
[null,"Primary","Very small","Medium FSM","Spend on energy as a percentage of total expenditure",{"$nulls":3},{"v":0.01,"d":"1.0%"},null,{"v":0.015,"d":"1.5%"},{"v":0.02,"d":"2.0%"}]
[null,"Primary","Very small","Medium FSM","Senior leaders as a percentage of workforce",null,null,{"v":0.105,"d":"10.5%"},{"v":0.12,"d":"12.0%"},{"v":0.135,"d":"13.5%"},{"v":0.175,"d":"17.5%"},{"v":0.205,"d":"20.5%"}]
[null,"Primary","Very small","Medium FSM","Pupil to teacher ratio",{"v":12,"d":"12.0"},{"v":14,"d":"14.0"},{"v":16,"d":"16.0"},{"v":17,"d":"17.0"},17.5,{"v":20,"d":"20.0"},21.5]
[null,"Primary","Very small","Medium FSM","Pupil to adult ratio",5.5,6.5,7.5,{"v":8,"d":"8.0"},8.5,9.5,10.5]
[null,"Primary","Very small","Medium FSM","Average class size",14.5,{"v":17,"d":"17.0"},{"v":20,"d":"20.0"},21.5,22.5,24.5,{"v":26,"d":"26.0"}]
[]
[994,"Primary","Small","Medium FSM","PSM"]
[null,"Primary","Small","Medium FSM","Spend on teaching staff as a percentage of total expenditure",{"v":0.385,"d":"38.5%"},{"v":0.41,"d":"41.0%"},{"v":0.445,"d":"44.5%"},{"v":0.455,"d":"45.5%"},{"v":0.47,"d":"47.0%"},{"v":0.495,"d":"49.5%"},{"v":0.525,"d":"52.5%"}]
[null,"Primary","Small","Medium FSM","Spend on supply staff as a percentage of total expenditure",null,null,{"v":0.02,"d":"2.0%"},{"v":0.025,"d":"2.5%"},{"v":0.03,"d":"3.0%"},{"v":0.04,"d":"4.0%"},{"v":0.055,"d":"5.5%"}]
[null,"Primary","Small","Medium FSM","Spend on education support staff as a percentage of total expenditure",null,null,{"v":0.15,"d":"15.0%"},{"v":0.16,"d":"16.0%"},{"v":0.17,"d":"17.0%"},{"v":0.195,"d":"19.5%"},{"v":0.22,"d":"22.0%"}]
[null,"Primary","Small","Medium FSM","Spend on administrative and clerical staff as a percentage of total expenditure",{"$nulls":3},{"v":0.05,"d":"5.0%"},null,{"v":0.065,"d":"6.5%"},{"v":0.075,"d":"7.5%"}]
[null,"Primary","Small","Medium FSM","Spend on other staff costs as a percentage of total expenditure",{"$nulls":3},{"v":0.035,"d":"3.5%"},null,{"v":0.05,"d":"5.0%"},{"v":0.065,"d":"6.5%"}]
[null,"Primary","Small","Medium FSM","Spend on premises (including staff costs) as a percentage of total expenditure",{"$nulls":3},{"v":0.05,"d":"5.0%"},null,{"v":0.065,"d":"6.5%"},{"v":0.075,"d":"7.5%"}]
[null,"Primary","Small","Medium FSM","Spend on teaching resources as a percentage of total expenditure",{"v":0.03,"d":"3.0%"},{"v":0.035,"d":"3.5%"},{"v":0.045,"d":"4.5%"},{"v":0.05,"d":"5.0%"},{"v":0.055,"d":"5.5%"}]
[null,"Primary","Small","Medium FSM","Spend on energy as a percentage of total expenditure",{"$nulls":3},{"v":0.01,"d":"1.0%"},null,{"v":0.015,"d":"1.5%"},{"v":0.02,"d":"2.0%"}]
[null,"Primary","Small","Medium FSM","Senior leaders as a percentage of workforce",null,null,{"v":0.095,"d":"9.5%"},{"v":0.11,"d":"11.0%"},{"v":0.12,"d":"12.0%"},{"v":0.14,"d":"14.0%"},{"v":0.165,"d":"16.5%"}]
[null,"Primary","Small","Medium FSM","Pupil to teacher ratio",16.5,17.5,{"v":19,"d":"19.0"},{"v":20,"d":"20.0"},20.5,22.5,{"v":24,"d":"24.0"}]
[null,"Primary","Small","Medium FSM","Pupil to adult ratio",{"v":7,"d":"7.0"},{"v":8,"d":"8.0"},8.5,{"v":9,"d":"9.0"},9.5,10.5,11.5]
[null,"Primary","Small","Medium FSM","Average class size",21.5,{"v":23,"d":"23.0"},24.5,25.5,26.5,{"v":28,"d":"28.0"},{"v":29,"d":"29.0"}]
[]
[{"v":3735,"d":"3,735"},"Primary","Medium","Medium FSM","PMM"]
[null,"Primary","Medium","Medium FSM","Spend on teaching staff as a percentage of total expenditure",{"v":0.39,"d":"39.0%"},{"v":0.415,"d":"41.5%"},{"v":0.44,"d":"44.0%"},{"v":0.455,"d":"45.5%"},{"v":0.465,"d":"46.5%"},{"v":0.495,"d":"49.5%"},{"v":0.515,"d":"51.5%"}]
[null,"Primary","Medium","Medium FSM","Spend on supply staff as a percentage of total expenditure",null,null,{"v":0.02,"d":"2.0%"},{"v":0.025,"d":"2.5%"},{"v":0.03,"d":"3.0%"},{"v":0.04,"d":"4.0%"},{"v":0.055,"d":"5.5%"}]
[null,"Primary","Medium","Medium FSM","Spend on education support staff as a percentage of total expenditure",null,null,{"v":0.165,"d":"16.5%"},{"v":0.175,"d":"17.5%"},{"v":0.185,"d":"18.5%"},{"v":0.21,"d":"21.0%"},{"v":0.235,"d":"23.5%"}]
[null,"Primary","Medium","Medium FSM","Spend on administrative and clerical staff as a percentage of total expenditure",{"$nulls":3},{"v":0.045,"d":"4.5%"},null,{"v":0.06,"d":"6.0%"},{"v":0.07,"d":"7.0%"}]
[null,"Primary","Medium","Medium FSM","Spend on other staff costs as a percentage of total expenditure",{"$nulls":3},{"v":0.035,"d":"3.5%"},null,{"v":0.05,"d":"5.0%"},{"v":0.06,"d":"6.0%"}]
[null,"Primary","Medium","Medium FSM","Spend on premises (including staff costs) as a percentage of total expenditure",{"$nulls":3},{"v":0.05,"d":"5.0%"},null,{"v":0.065,"d":"6.5%"},{"v":0.075,"d":"7.5%"}]
[null,"Primary","Medium","Medium FSM","Spend on teaching resources as a percentage of total expenditure",{"v":0.03,"d":"3.0%"},{"v":0.035,"d":"3.5%"},{"v":0.045,"d":"4.5%"},{"v":0.05,"d":"5.0%"},{"v":0.055,"d":"5.5%"}]
[null,"Primary","Medium","Medium FSM","Spend on energy as a percentage of total expenditure",{"$nulls":3},{"v":0.01,"d":"1.0%"},null,{"v":0.015,"d":"1.5%"},{"v":0.02,"d":"2.0%"}]
[null,"Primary","Medium","Medium FSM","Senior leaders as a percentage of workforce",null,null,{"v":0.08,"d":"8.0%"},{"v":0.085,"d":"8.5%"},{"v":0.095,"d":"9.5%"},{"v":0.11,"d":"11.0%"},{"v":0.13,"d":"13.0%"}]
[null,"Primary","Medium","Medium FSM","Pupil to teacher ratio",{"v":18,"d":"18.0"},19.5,{"v":21,"d":"21.0"},21.5,22.5,{"v":24,"d":"24.0"},25.5]
[null,"Primary","Medium","Medium FSM","Pupil to adult ratio",{"v":8,"d":"8.0"},8.5,9.5,9.5,{"v":10,"d":"10.0"},{"v":11,"d":"11.0"},11.5]
[null,"Primary","Medium","Medium FSM","Average class size",24.5,{"v":26,"d":"26.0"},27.5,{"v":28,"d":"28.0"},28.5,29.5,{"v":30,"d":"30.0"}]
[]
[{"v":2027,"d":"2,027"},"Primary","Large","Medium FSM","PLM"]
[null,"Primary","Large","Medium FSM","Spend on teaching staff as a percentage of total expenditure",{"v":0.385,"d":"38.5%"},{"v":0.41,"d":"41.0%"},{"v":0.445,"d":"44.5%"},{"v":0.455,"d":"45.5%"},{"v":0.47,"d":"47.0%"},{"v":0.495,"d":"49.5%"},{"v":0.52,"d":"52.0%"}]
[null,"Primary","Large","Medium FSM","Spend on supply staff as a percentage of total expenditure",null,null,{"v":0.02,"d":"2.0%"},{"v":0.02,"d":"2.0%"},{"v":0.03,"d":"3.0%"},{"v":0.04,"d":"4.0%"},{"v":0.055,"d":"5.5%"}]
[null,"Primary","Large","Medium FSM","Spend on education support staff as a percentage of total expenditure",null,null,{"v":0.175,"d":"17.5%"},{"v":0.185,"d":"18.5%"},{"v":0.195,"d":"19.5%"},{"v":0.22,"d":"22.0%"},{"v":0.245,"d":"24.5%"}]
[null,"Primary","Large","Medium FSM","Spend on administrative and clerical staff as a percentage of total expenditure",{"$nulls":3},{"v":0.045,"d":"4.5%"},null,{"v":0.06,"d":"6.0%"},{"v":0.065,"d":"6.5%"}]
[null,"Primary","Large","Medium FSM","Spend on other staff costs as a percentage of total expenditure",{"$nulls":3},{"v":0.035,"d":"3.5%"},null,{"v":0.05,"d":"5.0%"},{"v":0.06,"d":"6.0%"}]
[null,"Primary","Large","Medium FSM","Spend on premises (including staff costs) as a percentage of total expenditure",{"$nulls":3},{"v":0.05,"d":"5.0%"},null,{"v":0.065,"d":"6.5%"},{"v":0.075,"d":"7.5%"}]
[null,"Primary","Large","Medium FSM","Spend on teaching resources as a percentage of total expenditure",{"v":0.03,"d":"3.0%"},{"v":0.035,"d":"3.5%"},{"v":0.045,"d":"4.5%"},{"v":0.045,"d":"4.5%"},{"v":0.05,"d":"5.0%"}]
[null,"Primary","Large","Medium FSM","Spend on energy as a percentage of total expenditure",{"$nulls":3},{"v":0.01,"d":"1.0%"},null,{"v":0.015,"d":"1.5%"},{"v":0.02,"d":"2.0%"}]
[null,"Primary","Large","Medium FSM","Senior leaders as a percentage of workforce",null,null,{"v":0.06,"d":"6.0%"},{"v":0.065,"d":"6.5%"},{"v":0.075,"d":"7.5%"},{"v":0.09,"d":"9.0%"},{"v":0.105,"d":"10.5%"}]
[null,"Primary","Large","Medium FSM","Pupil to teacher ratio",18.5,{"v":20,"d":"20.0"},21.5,{"v":22,"d":"22.0"},22.5,{"v":24,"d":"24.0"},{"v":25,"d":"25.0"}]
[null,"Primary","Large","Medium FSM","Pupil to adult ratio",{"v":8,"d":"8.0"},8.5,9.5,{"v":10,"d":"10.0"},{"v":10,"d":"10.0"},{"v":11,"d":"11.0"},{"v":12,"d":"12.0"}]
[null,"Primary","Large","Medium FSM","Average class size",{"v":26,"d":"26.0"},{"v":27,"d":"27.0"},28.5,{"v":29,"d":"29.0"},{"v":29,"d":"29.0"},29.5,{"v":30,"d":"30.0"}]
[]
[214,"Primary","Very small","High FSM","PVSH"]
[null,"Primary","Very small","High FSM","Spend on teaching staff as a percentage of total expenditure",{"v":0.36,"d":"36.0%"},{"v":0.395,"d":"39.5%"},{"v":0.425,"d":"42.5%"},{"v":0.44,"d":"44.0%"},{"v":0.455,"d":"45.5%"},{"v":0.49,"d":"49.0%"},{"v":0.52,"d":"52.0%"}]
[null,"Primary","Very small","High FSM","Spend on supply staff as a percentage of total expenditure",null,null,{"v":0.02,"d":"2.0%"},{"v":0.025,"d":"2.5%"},{"v":0.03,"d":"3.0%"},{"v":0.055,"d":"5.5%"},{"v":0.08,"d":"8.0%"}]
[null,"Primary","Very small","High FSM","Spend on education support staff as a percentage of total expenditure",null,null,{"v":0.14,"d":"14.0%"},{"v":0.15,"d":"15.0%"},{"v":0.17,"d":"17.0%"},{"v":0.2,"d":"20.0%"},{"v":0.235,"d":"23.5%"}]
[null,"Primary","Very small","High FSM","Spend on administrative and clerical staff as a percentage of total expenditure",{"$nulls":3},{"v":0.05,"d":"5.0%"},null,{"v":0.07,"d":"7.0%"},{"v":0.085,"d":"8.5%"}]
[null,"Primary","Very small","High FSM","Spend on other staff costs as a percentage of total expenditure",{"$nulls":3},{"v":0.035,"d":"3.5%"},null,{"v":0.05,"d":"5.0%"},{"v":0.065,"d":"6.5%"}]
[null,"Primary","Very small","High FSM","Spend on premises (including staff costs) as a percentage of total expenditure",{"$nulls":3},{"v":0.055,"d":"5.5%"},null,{"v":0.07,"d":"7.0%"},{"v":0.085,"d":"8.5%"}]
[null,"Primary","Very small","High FSM","Spend on teaching resources as a percentage of total expenditure",{"v":0.03,"d":"3.0%"},{"v":0.04,"d":"4.0%"},{"v":0.045,"d":"4.5%"},{"v":0.055,"d":"5.5%"},{"v":0.06,"d":"6.0%"}]
[null,"Primary","Very small","High FSM","Spend on energy as a percentage of total expenditure",{"$nulls":3},{"v":0.01,"d":"1.0%"},null,{"v":0.015,"d":"1.5%"},{"v":0.02,"d":"2.0%"}]
[null,"Primary","Very small","High FSM","Senior leaders as a percentage of workforce",null,null,{"v":0.105,"d":"10.5%"},{"v":0.12,"d":"12.0%"},{"v":0.135,"d":"13.5%"},{"v":0.17,"d":"17.0%"},{"v":0.2,"d":"20.0%"}]
[null,"Primary","Very small","High FSM","Pupil to teacher ratio",{"v":11,"d":"11.0"},{"v":13,"d":"13.0"},15.5,{"v":16,"d":"16.0"},{"v":17,"d":"17.0"},{"v":19,"d":"19.0"},{"v":20,"d":"20.0"}]
[null,"Primary","Very small","High FSM","Pupil to adult ratio",{"v":5,"d":"5.0"},5.5,6.5,{"v":7,"d":"7.0"},7.5,8.5,{"v":9,"d":"9.0"}]
[null,"Primary","Very small","High FSM","Average class size",{"v":13,"d":"13.0"},16.5,19.5,{"v":21,"d":"21.0"},22.5,{"v":24,"d":"24.0"},25.5]
[]
[370,"Primary","Small","High FSM","PSH"]
[null,"Primary","Small","High FSM","Spend on teaching staff as a percentage of total expenditure",{"v":0.365,"d":"36.5%"},{"v":0.39,"d":"39.0%"},{"v":0.42,"d":"42.0%"},{"v":0.435,"d":"43.5%"},{"v":0.45,"d":"45.0%"},{"v":0.48,"d":"48.0%"},{"v":0.515,"d":"51.5%"}]
[null,"Primary","Small","High FSM","Spend on supply staff as a percentage of total expenditure",null,null,{"v":0.02,"d":"2.0%"},{"v":0.025,"d":"2.5%"},{"v":0.035,"d":"3.5%"},{"v":0.055,"d":"5.5%"},{"v":0.075,"d":"7.5%"}]
[null,"Primary","Small","High FSM","Spend on education support staff as a percentage of total expenditure",null,null,{"v":0.165,"d":"16.5%"},{"v":0.175,"d":"17.5%"},{"v":0.185,"d":"18.5%"},{"v":0.215,"d":"21.5%"},{"v":0.23,"d":"23.0%"}]
[null,"Primary","Small","High FSM","Spend on administrative and clerical staff as a percentage of total expenditure",{"$nulls":3},{"v":0.045,"d":"4.5%"},null,{"v":0.065,"d":"6.5%"},{"v":0.075,"d":"7.5%"}]
[null,"Primary","Small","High FSM","Spend on other staff costs as a percentage of total expenditure",{"$nulls":3},{"v":0.035,"d":"3.5%"},null,{"v":0.05,"d":"5.0%"},{"v":0.065,"d":"6.5%"}]
[null,"Primary","Small","High FSM","Spend on premises (including staff costs) as a percentage of total expenditure",{"$nulls":3},{"v":0.055,"d":"5.5%"},null,{"v":0.07,"d":"7.0%"},{"v":0.08,"d":"8.0%"}]
[null,"Primary","Small","High FSM","Spend on teaching resources as a percentage of total expenditure",{"v":0.025,"d":"2.5%"},{"v":0.035,"d":"3.5%"},{"v":0.045,"d":"4.5%"},{"v":0.05,"d":"5.0%"},{"v":0.055,"d":"5.5%"}]
[null,"Primary","Small","High FSM","Spend on energy as a percentage of total expenditure",{"$nulls":3},{"v":0.01,"d":"1.0%"},null,{"v":0.015,"d":"1.5%"},{"v":0.02,"d":"2.0%"}]
[null,"Primary","Small","High FSM","Senior leaders as a percentage of workforce",null,null,{"v":0.095,"d":"9.5%"},{"v":0.105,"d":"10.5%"},{"v":0.115,"d":"11.5%"},{"v":0.135,"d":"13.5%"},{"v":0.155,"d":"15.5%"}]
[null,"Primary","Small","High FSM","Pupil to teacher ratio",{"v":15,"d":"15.0"},{"v":16,"d":"16.0"},17.5,{"v":18,"d":"18.0"},{"v":19,"d":"19.0"},{"v":21,"d":"21.0"},22.5]
[null,"Primary","Small","High FSM","Pupil to adult ratio",6.5,{"v":7,"d":"7.0"},7.5,{"v":8,"d":"8.0"},8.5,{"v":9,"d":"9.0"},{"v":10,"d":"10.0"}]
[null,"Primary","Small","High FSM","Average class size",{"v":19,"d":"19.0"},20.5,22.5,{"v":23,"d":"23.0"},{"v":24,"d":"24.0"},26.5,{"v":28,"d":"28.0"}]
[]
[{"v":2197,"d":"2,197"},"Primary","Medium","High FSM","PMH"]
[null,"Primary","Medium","High FSM","Spend on teaching staff as a percentage of total expenditure",{"v":0.36,"d":"36.0%"},{"v":0.385,"d":"38.5%"},{"v":0.41,"d":"41.0%"},{"v":0.425,"d":"42.5%"},{"v":0.435,"d":"43.5%"},{"v":0.465,"d":"46.5%"},{"v":0.49,"d":"49.0%"}]
[null,"Primary","Medium","High FSM","Spend on supply staff as a percentage of total expenditure",null,null,{"v":0.02,"d":"2.0%"},{"v":0.025,"d":"2.5%"},{"v":0.03,"d":"3.0%"},{"v":0.045,"d":"4.5%"},{"v":0.065,"d":"6.5%"}]
[null,"Primary","Medium","High FSM","Spend on education support staff as a percentage of total expenditure",null,null,{"v":0.185,"d":"18.5%"},{"v":0.2,"d":"20.0%"},{"v":0.21,"d":"21.0%"},{"v":0.235,"d":"23.5%"},{"v":0.26,"d":"26.0%"}]
[null,"Primary","Medium","High FSM","Spend on administrative and clerical staff as a percentage of total expenditure",{"$nulls":3},{"v":0.045,"d":"4.5%"},null,{"v":0.06,"d":"6.0%"},{"v":0.075,"d":"7.5%"}]
[null,"Primary","Medium","High FSM","Spend on other staff costs as a percentage of total expenditure",{"$nulls":3},{"v":0.035,"d":"3.5%"},null,{"v":0.05,"d":"5.0%"},{"v":0.06,"d":"6.0%"}]
[null,"Primary","Medium","High FSM","Spend on premises (including staff costs) as a percentage of total expenditure",{"$nulls":3},{"v":0.055,"d":"5.5%"},null,{"v":0.07,"d":"7.0%"},{"v":0.08,"d":"8.0%"}]
[null,"Primary","Medium","High FSM","Spend on teaching resources as a percentage of total expenditure",{"v":0.025,"d":"2.5%"},{"v":0.035,"d":"3.5%"},{"v":0.04,"d":"4.0%"},{"v":0.045,"d":"4.5%"},{"v":0.05,"d":"5.0%"}]
[null,"Primary","Medium","High FSM","Spend on energy as a percentage of total expenditure",{"$nulls":3},{"v":0.01,"d":"1.0%"},null,{"v":0.015,"d":"1.5%"},{"v":0.02,"d":"2.0%"}]
[null,"Primary","Medium","High FSM","Senior leaders as a percentage of workforce",null,null,{"v":0.075,"d":"7.5%"},{"v":0.08,"d":"8.0%"},{"v":0.09,"d":"9.0%"},{"v":0.11,"d":"11.0%"},{"v":0.13,"d":"13.0%"}]
[null,"Primary","Medium","High FSM","Pupil to teacher ratio",{"v":16,"d":"16.0"},17.5,{"v":19,"d":"19.0"},19.5,20.5,22.5,{"v":24,"d":"24.0"}]
[null,"Primary","Medium","High FSM","Pupil to adult ratio",6.5,7.5,{"v":8,"d":"8.0"},8.5,8.5,9.5,{"v":10,"d":"10.0"}]
[null,"Primary","Medium","High FSM","Average class size",22.5,23.5,25.5,26.5,{"v":27,"d":"27.0"},28.5,29.5]
[]
[{"v":1120,"d":"1,120"},"Primary","Large","High FSM","PLH"]
[null,"Primary","Large","High FSM","Spend on teaching staff as a percentage of total expenditure",{"v":0.355,"d":"35.5%"},{"v":0.38,"d":"38.0%"},{"v":0.41,"d":"41.0%"},{"v":0.425,"d":"42.5%"},{"v":0.435,"d":"43.5%"},{"v":0.465,"d":"46.5%"},{"v":0.49,"d":"49.0%"}]
[null,"Primary","Large","High FSM","Spend on supply staff as a percentage of total expenditure",null,null,{"v":0.02,"d":"2.0%"},{"v":0.025,"d":"2.5%"},{"v":0.03,"d":"3.0%"},{"v":0.045,"d":"4.5%"},{"v":0.06,"d":"6.0%"}]
[null,"Primary","Large","High FSM","Spend on education support staff as a percentage of total expenditure",null,null,{"v":0.195,"d":"19.5%"},{"v":0.205,"d":"20.5%"},{"v":0.22,"d":"22.0%"},{"v":0.25,"d":"25.0%"},{"v":0.265,"d":"26.5%"}]
[null,"Primary","Large","High FSM","Spend on administrative and clerical staff as a percentage of total expenditure",{"$nulls":3},{"v":0.045,"d":"4.5%"},null,{"v":0.06,"d":"6.0%"},{"v":0.075,"d":"7.5%"}]
[null,"Primary","Large","High FSM","Spend on other staff costs as a percentage of total expenditure",{"$nulls":3},{"v":0.035,"d":"3.5%"},null,{"v":0.045,"d":"4.5%"},{"v":0.06,"d":"6.0%"}]
[null,"Primary","Large","High FSM","Spend on premises (including staff costs) as a percentage of total expenditure",{"$nulls":3},{"v":0.05,"d":"5.0%"},null,{"v":0.07,"d":"7.0%"},{"v":0.08,"d":"8.0%"}]
[null,"Primary","Large","High FSM","Spend on teaching resources as a percentage of total expenditure",{"v":0.025,"d":"2.5%"},{"v":0.03,"d":"3.0%"},{"v":0.04,"d":"4.0%"},{"v":0.045,"d":"4.5%"},{"v":0.05,"d":"5.0%"}]
[null,"Primary","Large","High FSM","Spend on energy as a percentage of total expenditure",{"$nulls":3},{"v":0.01,"d":"1.0%"},null,{"v":0.015,"d":"1.5%"},{"v":0.02,"d":"2.0%"}]
[null,"Primary","Large","High FSM","Senior leaders as a percentage of workforce",null,null,{"v":0.065,"d":"6.5%"},{"v":0.07,"d":"7.0%"},{"v":0.075,"d":"7.5%"},{"v":0.09,"d":"9.0%"},{"v":0.105,"d":"10.5%"}]
[null,"Primary","Large","High FSM","Pupil to teacher ratio",{"v":17,"d":"17.0"},{"v":18,"d":"18.0"},{"v":20,"d":"20.0"},20.5,{"v":21,"d":"21.0"},{"v":23,"d":"23.0"},24.5]
[null,"Primary","Large","High FSM","Pupil to adult ratio",{"v":7,"d":"7.0"},7.5,{"v":8,"d":"8.0"},8.5,{"v":9,"d":"9.0"},9.5,10.5]
[null,"Primary","Large","High FSM","Average class size",24.5,25.5,{"v":27,"d":"27.0"},27.5,{"v":28,"d":"28.0"},{"v":29,"d":"29.0"},29.5]
[]
[]
["Sample size","Phase","Size","FSM",null,"Red if less than:","Amber if less than:","Dark green if between:","(Median)","and:","Amber if more than:","Red if more than:",null,"Light green for everything else"]
[59,"Secondary with sixth form","Small","Low FSM","SSSL"]
[null,"Secondary with sixth form","Small","Low FSM","Spend on teaching staff as a percentage of total expenditure",{"v":0.455,"d":"45.5%"},{"v":0.49,"d":"49.0%"},{"v":0.54,"d":"54.0%"},{"v":0.56,"d":"56.0%"},{"v":0.57,"d":"57.0%"},{"v":0.61,"d":"61.0%"},{"v":0.625,"d":"62.5%"}]
[null,"Secondary with sixth form","Small","Low FSM","Spend on supply staff as a percentage of total expenditure",null,null,{"v":0.01,"d":"1.0%"},{"v":0.015,"d":"1.5%"},{"v":0.02,"d":"2.0%"},{"v":0.03,"d":"3.0%"},{"v":0.04,"d":"4.0%"}]
[null,"Secondary with sixth form","Small","Low FSM","Spend on education support staff as a percentage of total expenditure",null,null,{"v":0.05,"d":"5.0%"},{"v":0.06,"d":"6.0%"},{"v":0.07,"d":"7.0%"},{"v":0.09,"d":"9.0%"},{"v":0.11,"d":"11.0%"}]
[null,"Secondary with sixth form","Small","Low FSM","Spend on administrative and clerical staff as a percentage of total expenditure",{"$nulls":3},{"v":0.065,"d":"6.5%"},null,{"v":0.09,"d":"9.0%"},{"v":0.1,"d":"10.0%"}]
[null,"Secondary with sixth form","Small","Low FSM","Spend on other staff costs as a percentage of total expenditure",{"$nulls":3},{"v":0.01,"d":"1.0%"},null,{"v":0.045,"d":"4.5%"},{"v":0.07,"d":"7.0%"}]
[null,"Secondary with sixth form","Small","Low FSM","Spend on premises (including staff costs) as a percentage of total expenditure",{"$nulls":3},{"v":0.05,"d":"5.0%"},null,{"v":0.075,"d":"7.5%"},{"v":0.085,"d":"8.5%"}]
[null,"Secondary with sixth form","Small","Low FSM","Spend on teaching resources as a percentage of total expenditure",{"v":0.05,"d":"5.0%"},{"v":0.06,"d":"6.0%"},{"v":0.07,"d":"7.0%"},{"v":0.075,"d":"7.5%"},{"v":0.085,"d":"8.5%"}]
[null,"Secondary with sixth form","Small","Low FSM","Spend on energy as a percentage of total expenditure",{"$nulls":3},{"v":0.01,"d":"1.0%"},null,{"v":0.015,"d":"1.5%"},{"v":0.02,"d":"2.0%"}]
[null,"Secondary with sixth form","Small","Low FSM","Senior leaders as a percentage of workforce",null,null,{"v":0.06,"d":"6.0%"},{"v":0.065,"d":"6.5%"},{"v":0.07,"d":"7.0%"},{"v":0.09,"d":"9.0%"},{"v":0.14,"d":"14.0%"}]
[null,"Secondary with sixth form","Small","Low FSM","Pupil to teacher ratio",{"v":12,"d":"12.0"},13.5,15.5,{"v":16,"d":"16.0"},{"v":17,"d":"17.0"},{"v":18,"d":"18.0"},18.5]
[null,"Secondary with sixth form","Small","Low FSM","Pupil to adult ratio",7.5,8.5,{"v":10,"d":"10.0"},{"v":10,"d":"10.0"},10.5,11.5,{"v":12,"d":"12.0"}]
[null,"Secondary with sixth form","Small","Low FSM","Average class size",{"v":14,"d":"14.0"},{"v":18,"d":"18.0"},19.5,19.5,20.5,{"v":22,"d":"22.0"},{"v":23,"d":"23.0"}]
[]
[304,"Secondary with sixth form","Medium","Low FSM","SSML"]
[null,"Secondary with sixth form","Medium","Low FSM","Spend on teaching staff as a percentage of total expenditure",{"v":0.495,"d":"49.5%"},{"v":0.525,"d":"52.5%"},{"v":0.555,"d":"55.5%"},{"v":0.56,"d":"56.0%"},{"v":0.575,"d":"57.5%"},{"v":0.61,"d":"61.0%"},{"v":0.63,"d":"63.0%"}]
[null,"Secondary with sixth form","Medium","Low FSM","Spend on supply staff as a percentage of total expenditure",null,null,{"v":0.01,"d":"1.0%"},{"v":0.01,"d":"1.0%"},{"v":0.015,"d":"1.5%"},{"v":0.02,"d":"2.0%"},{"v":0.025,"d":"2.5%"}]
[null,"Secondary with sixth form","Medium","Low FSM","Spend on education support staff as a percentage of total expenditure",null,null,{"v":0.07,"d":"7.0%"},{"v":0.075,"d":"7.5%"},{"v":0.08,"d":"8.0%"},{"v":0.1,"d":"10.0%"},{"v":0.11,"d":"11.0%"}]
[null,"Secondary with sixth form","Medium","Low FSM","Spend on administrative and clerical staff as a percentage of total expenditure",{"$nulls":3},{"v":0.065,"d":"6.5%"},null,{"v":0.085,"d":"8.5%"},{"v":0.1,"d":"10.0%"}]
[null,"Secondary with sixth form","Medium","Low FSM","Spend on other staff costs as a percentage of total expenditure",{"$nulls":3},{"v":0.015,"d":"1.5%"},null,{"v":0.03,"d":"3.0%"},{"v":0.055,"d":"5.5%"}]
[null,"Secondary with sixth form","Medium","Low FSM","Spend on premises (including staff costs) as a percentage of total expenditure",{"$nulls":3},{"v":0.055,"d":"5.5%"},null,{"v":0.07,"d":"7.0%"},{"v":0.08,"d":"8.0%"}]
[null,"Secondary with sixth form","Medium","Low FSM","Spend on teaching resources as a percentage of total expenditure",{"v":0.05,"d":"5.0%"},{"v":0.06,"d":"6.0%"},{"v":0.075,"d":"7.5%"},{"v":0.085,"d":"8.5%"},{"v":0.09,"d":"9.0%"}]
[null,"Secondary with sixth form","Medium","Low FSM","Spend on energy as a percentage of total expenditure",{"$nulls":3},{"v":0.01,"d":"1.0%"},null,{"v":0.015,"d":"1.5%"},{"v":0.02,"d":"2.0%"}]
[null,"Secondary with sixth form","Medium","Low FSM","Senior leaders as a percentage of workforce",null,null,{"v":0.055,"d":"5.5%"},{"v":0.06,"d":"6.0%"},{"v":0.065,"d":"6.5%"},{"v":0.075,"d":"7.5%"},{"v":0.085,"d":"8.5%"}]
[null,"Secondary with sixth form","Medium","Low FSM","Pupil to teacher ratio",{"v":15,"d":"15.0"},15.5,16.5,{"v":17,"d":"17.0"},17.5,18.5,{"v":19,"d":"19.0"}]
[null,"Secondary with sixth form","Medium","Low FSM","Pupil to adult ratio",{"v":9,"d":"9.0"},9.5,10.5,10.5,{"v":11,"d":"11.0"},11.5,12.5]
[null,"Secondary with sixth form","Medium","Low FSM","Average class size",19.5,{"v":20,"d":"20.0"},{"v":21,"d":"21.0"},21.5,21.5,22.5,23.5]
[]
[206,"Secondary with sixth form","Large","Low FSM","SSLL"]
[null,"Secondary with sixth form","Large","Low FSM","Spend on teaching staff as a percentage of total expenditure",{"v":0.505,"d":"50.5%"},{"v":0.53,"d":"53.0%"},{"v":0.56,"d":"56.0%"},{"v":0.575,"d":"57.5%"},{"v":0.59,"d":"59.0%"},{"v":0.61,"d":"61.0%"},{"v":0.625,"d":"62.5%"}]
[null,"Secondary with sixth form","Large","Low FSM","Spend on supply staff as a percentage of total expenditure",null,null,{"v":0.01,"d":"1.0%"},{"v":0.01,"d":"1.0%"},{"v":0.015,"d":"1.5%"},{"v":0.02,"d":"2.0%"},{"v":0.03,"d":"3.0%"}]
[null,"Secondary with sixth form","Large","Low FSM","Spend on education support staff as a percentage of total expenditure",null,null,{"v":0.075,"d":"7.5%"},{"v":0.08,"d":"8.0%"},{"v":0.09,"d":"9.0%"},{"v":0.11,"d":"11.0%"},{"v":0.12,"d":"12.0%"}]
[null,"Secondary with sixth form","Large","Low FSM","Spend on administrative and clerical staff as a percentage of total expenditure",{"$nulls":3},{"v":0.06,"d":"6.0%"},null,{"v":0.08,"d":"8.0%"},{"v":0.095,"d":"9.5%"}]
[null,"Secondary with sixth form","Large","Low FSM","Spend on other staff costs as a percentage of total expenditure",{"$nulls":3},{"v":0.015,"d":"1.5%"},null,{"v":0.035,"d":"3.5%"},{"v":0.055,"d":"5.5%"}]
[null,"Secondary with sixth form","Large","Low FSM","Spend on premises (including staff costs) as a percentage of total expenditure",{"$nulls":3},{"v":0.055,"d":"5.5%"},null,{"v":0.065,"d":"6.5%"},{"v":0.08,"d":"8.0%"}]
[null,"Secondary with sixth form","Large","Low FSM","Spend on teaching resources as a percentage of total expenditure",{"v":0.05,"d":"5.0%"},{"v":0.055,"d":"5.5%"},{"v":0.07,"d":"7.0%"},{"v":0.075,"d":"7.5%"},{"v":0.085,"d":"8.5%"}]
[null,"Secondary with sixth form","Large","Low FSM","Spend on energy as a percentage of total expenditure",{"$nulls":3},{"v":0.01,"d":"1.0%"},null,{"v":0.015,"d":"1.5%"},{"v":0.02,"d":"2.0%"}]
[null,"Secondary with sixth form","Large","Low FSM","Senior leaders as a percentage of workforce",null,null,{"v":0.05,"d":"5.0%"},{"v":0.055,"d":"5.5%"},{"v":0.055,"d":"5.5%"},{"v":0.065,"d":"6.5%"},{"v":0.075,"d":"7.5%"}]
[null,"Secondary with sixth form","Large","Low FSM","Pupil to teacher ratio",15.5,{"v":16,"d":"16.0"},16.5,{"v":17,"d":"17.0"},{"v":17,"d":"17.0"},{"v":18,"d":"18.0"},18.5]
[null,"Secondary with sixth form","Large","Low FSM","Pupil to adult ratio",{"v":9,"d":"9.0"},9.5,{"v":10,"d":"10.0"},10.5,10.5,{"v":11,"d":"11.0"},{"v":12,"d":"12.0"}]
[null,"Secondary with sixth form","Large","Low FSM","Average class size",19.5,{"v":20,"d":"20.0"},20.5,{"v":21,"d":"21.0"},21.5,22.5,23.5]
[]
[36,"Secondary without sixth form","Small","Low FSM","SSL"]
[null,"Secondary without sixth form","Small","Low FSM","Spend on teaching staff as a percentage of total expenditure",{"v":0.445,"d":"44.5%"},{"v":0.495,"d":"49.5%"},{"v":0.525,"d":"52.5%"},{"v":0.545,"d":"54.5%"},{"v":0.55,"d":"55.0%"},{"v":0.58,"d":"58.0%"},{"v":0.6,"d":"60.0%"}]
[null,"Secondary without sixth form","Small","Low FSM","Spend on supply staff as a percentage of total expenditure",null,null,{"v":0.01,"d":"1.0%"},{"v":0.015,"d":"1.5%"},{"v":0.025,"d":"2.5%"},{"v":0.04,"d":"4.0%"},{"v":0.05,"d":"5.0%"}]
[null,"Secondary without sixth form","Small","Low FSM","Spend on education support staff as a percentage of total expenditure",null,null,{"v":0.09,"d":"9.0%"},{"v":0.095,"d":"9.5%"},{"v":0.1,"d":"10.0%"},{"v":0.125,"d":"12.5%"},{"v":0.145,"d":"14.5%"}]
[null,"Secondary without sixth form","Small","Low FSM","Spend on administrative and clerical staff as a percentage of total expenditure",{"$nulls":3},{"v":0.065,"d":"6.5%"},null,{"v":0.085,"d":"8.5%"},{"v":0.09,"d":"9.0%"}]
[null,"Secondary without sixth form","Small","Low FSM","Spend on other staff costs as a percentage of total expenditure",{"$nulls":3},{"v":0.02,"d":"2.0%"},null,{"v":0.04,"d":"4.0%"},{"v":0.065,"d":"6.5%"}]
[null,"Secondary without sixth form","Small","Low FSM","Spend on premises (including staff costs) as a percentage of total expenditure",{"$nulls":3},{"v":0.055,"d":"5.5%"},null,{"v":0.08,"d":"8.0%"},{"v":0.1,"d":"10.0%"}]
[null,"Secondary without sixth form","Small","Low FSM","Spend on teaching resources as a percentage of total expenditure",{"v":0.035,"d":"3.5%"},{"v":0.045,"d":"4.5%"},{"v":0.05,"d":"5.0%"},{"v":0.06,"d":"6.0%"},{"v":0.07,"d":"7.0%"}]
[null,"Secondary without sixth form","Small","Low FSM","Spend on energy as a percentage of total expenditure",{"$nulls":3},{"v":0.01,"d":"1.0%"},null,{"v":0.015,"d":"1.5%"},{"v":0.02,"d":"2.0%"}]
[null,"Secondary without sixth form","Small","Low FSM","Senior leaders as a percentage of workforce",null,null,{"v":0.07,"d":"7.0%"},{"v":0.085,"d":"8.5%"},{"v":0.09,"d":"9.0%"},{"v":0.11,"d":"11.0%"},{"v":0.125,"d":"12.5%"}]
[null,"Secondary without sixth form","Small","Low FSM","Pupil to teacher ratio",{"v":13,"d":"13.0"},{"v":15,"d":"15.0"},{"v":17,"d":"17.0"},17.5,{"v":18,"d":"18.0"},19.5,20.5]
[null,"Secondary without sixth form","Small","Low FSM","Pupil to adult ratio",{"v":7,"d":"7.0"},{"v":8,"d":"8.0"},9.5,{"v":10,"d":"10.0"},10.5,{"v":11,"d":"11.0"},11.5]
[null,"Secondary without sixth form","Small","Low FSM","Average class size",19.5,21.5,{"v":23,"d":"23.0"},{"v":24,"d":"24.0"},25.5,{"v":27,"d":"27.0"},27.5]
[]
[95,"Secondary without sixth form","Medium","Low FSM","SML"]
[null,"Secondary without sixth form","Medium","Low FSM","Spend on teaching staff as a percentage of total expenditure",{"v":0.49,"d":"49.0%"},{"v":0.505,"d":"50.5%"},{"v":0.545,"d":"54.5%"},{"v":0.55,"d":"55.0%"},{"v":0.57,"d":"57.0%"},{"v":0.595,"d":"59.5%"},{"v":0.62,"d":"62.0%"}]
[null,"Secondary without sixth form","Medium","Low FSM","Spend on supply staff as a percentage of total expenditure",null,null,{"v":0.015,"d":"1.5%"},{"v":0.015,"d":"1.5%"},{"v":0.02,"d":"2.0%"},{"v":0.025,"d":"2.5%"},{"v":0.035,"d":"3.5%"}]
[null,"Secondary without sixth form","Medium","Low FSM","Spend on education support staff as a percentage of total expenditure",null,null,{"v":0.09,"d":"9.0%"},{"v":0.09,"d":"9.0%"},{"v":0.1,"d":"10.0%"},{"v":0.125,"d":"12.5%"},{"v":0.14,"d":"14.0%"}]
[null,"Secondary without sixth form","Medium","Low FSM","Spend on administrative and clerical staff as a percentage of total expenditure",{"$nulls":3},{"v":0.065,"d":"6.5%"},null,{"v":0.08,"d":"8.0%"},{"v":0.1,"d":"10.0%"}]
[null,"Secondary without sixth form","Medium","Low FSM","Spend on other staff costs as a percentage of total expenditure",{"$nulls":3},{"v":0.015,"d":"1.5%"},null,{"v":0.03,"d":"3.0%"},{"v":0.04,"d":"4.0%"}]
[null,"Secondary without sixth form","Medium","Low FSM","Spend on premises (including staff costs) as a percentage of total expenditure",{"$nulls":3},{"v":0.055,"d":"5.5%"},null,{"v":0.07,"d":"7.0%"},{"v":0.09,"d":"9.0%"}]
[null,"Secondary without sixth form","Medium","Low FSM","Spend on teaching resources as a percentage of total expenditure",{"v":0.04,"d":"4.0%"},{"v":0.05,"d":"5.0%"},{"v":0.06,"d":"6.0%"},{"v":0.065,"d":"6.5%"},{"v":0.07,"d":"7.0%"}]
[null,"Secondary without sixth form","Medium","Low FSM","Spend on energy as a percentage of total expenditure",{"$nulls":3},{"v":0.01,"d":"1.0%"},null,{"v":0.015,"d":"1.5%"},{"v":0.02,"d":"2.0%"}]
[null,"Secondary without sixth form","Medium","Low FSM","Senior leaders as a percentage of workforce",null,null,{"v":0.06,"d":"6.0%"},{"v":0.06,"d":"6.0%"},{"v":0.07,"d":"7.0%"},{"v":0.085,"d":"8.5%"},{"v":0.105,"d":"10.5%"}]
[null,"Secondary without sixth form","Medium","Low FSM","Pupil to teacher ratio",{"v":16,"d":"16.0"},16.5,{"v":17,"d":"17.0"},{"v":17,"d":"17.0"},17.5,18.5,{"v":20,"d":"20.0"}]
[null,"Secondary without sixth form","Medium","Low FSM","Pupil to adult ratio",8.5,{"v":9,"d":"9.0"},9.5,{"v":10,"d":"10.0"},{"v":10,"d":"10.0"},{"v":11,"d":"11.0"},{"v":12,"d":"12.0"}]
[null,"Secondary without sixth form","Medium","Low FSM","Average class size",{"v":22,"d":"22.0"},22.5,23.5,{"v":24,"d":"24.0"},24.5,25.5,26.5]
[]
[65,"Secondary without sixth form","Large","Low FSM","SLL"]
[null,"Secondary without sixth form","Large","Low FSM","Spend on teaching staff as a percentage of total expenditure",{"v":0.485,"d":"48.5%"},{"v":0.515,"d":"51.5%"},{"v":0.55,"d":"55.0%"},{"v":0.56,"d":"56.0%"},{"v":0.575,"d":"57.5%"},{"v":0.595,"d":"59.5%"},{"v":0.61,"d":"61.0%"}]
[null,"Secondary without sixth form","Large","Low FSM","Spend on supply staff as a percentage of total expenditure",null,null,{"v":0.01,"d":"1.0%"},{"v":0.015,"d":"1.5%"},{"v":0.015,"d":"1.5%"},{"v":0.025,"d":"2.5%"},{"v":0.035,"d":"3.5%"}]
[null,"Secondary without sixth form","Large","Low FSM","Spend on education support staff as a percentage of total expenditure",null,null,{"v":0.08,"d":"8.0%"},{"v":0.085,"d":"8.5%"},{"v":0.095,"d":"9.5%"},{"v":0.11,"d":"11.0%"},{"v":0.125,"d":"12.5%"}]
[null,"Secondary without sixth form","Large","Low FSM","Spend on administrative and clerical staff as a percentage of total expenditure",{"$nulls":3},{"v":0.065,"d":"6.5%"},null,{"v":0.085,"d":"8.5%"},{"v":0.1,"d":"10.0%"}]
[null,"Secondary without sixth form","Large","Low FSM","Spend on other staff costs as a percentage of total expenditure",{"$nulls":3},{"v":0.015,"d":"1.5%"},null,{"v":0.035,"d":"3.5%"},{"v":0.055,"d":"5.5%"}]
[null,"Secondary without sixth form","Large","Low FSM","Spend on premises (including staff costs) as a percentage of total expenditure",{"$nulls":3},{"v":0.055,"d":"5.5%"},null,{"v":0.07,"d":"7.0%"},{"v":0.085,"d":"8.5%"}]
[null,"Secondary without sixth form","Large","Low FSM","Spend on teaching resources as a percentage of total expenditure",{"v":0.045,"d":"4.5%"},{"v":0.05,"d":"5.0%"},{"v":0.065,"d":"6.5%"},{"v":0.07,"d":"7.0%"},{"v":0.08,"d":"8.0%"}]
[null,"Secondary without sixth form","Large","Low FSM","Spend on energy as a percentage of total expenditure",{"$nulls":3},{"v":0.01,"d":"1.0%"},null,{"v":0.015,"d":"1.5%"},{"v":0.02,"d":"2.0%"}]
[null,"Secondary without sixth form","Large","Low FSM","Senior leaders as a percentage of workforce",null,null,{"v":0.05,"d":"5.0%"},{"v":0.055,"d":"5.5%"},{"v":0.06,"d":"6.0%"},{"v":0.075,"d":"7.5%"},{"v":0.09,"d":"9.0%"}]
[null,"Secondary without sixth form","Large","Low FSM","Pupil to teacher ratio",{"v":15,"d":"15.0"},{"v":16,"d":"16.0"},16.5,{"v":17,"d":"17.0"},17.5,{"v":18,"d":"18.0"},18.5]
[null,"Secondary without sixth form","Large","Low FSM","Pupil to adult ratio",8.5,{"v":9,"d":"9.0"},{"v":10,"d":"10.0"},{"v":10,"d":"10.0"},10.5,{"v":11,"d":"11.0"},11.5]
[null,"Secondary without sixth form","Large","Low FSM","Average class size",{"v":22,"d":"22.0"},{"v":23,"d":"23.0"},23.5,23.5,{"v":24,"d":"24.0"},{"v":25,"d":"25.0"},25.5]
[]
[278,"Secondary with sixth form","Small","Medium FSM","SSSM"]
[null,"Secondary with sixth form","Small","Medium FSM","Spend on teaching staff as a percentage of total expenditure",{"v":0.455,"d":"45.5%"},{"v":0.48,"d":"48.0%"},{"v":0.52,"d":"52.0%"},{"v":0.535,"d":"53.5%"},{"v":0.55,"d":"55.0%"},{"v":0.585,"d":"58.5%"},{"v":0.615,"d":"61.5%"}]
[null,"Secondary with sixth form","Small","Medium FSM","Spend on supply staff as a percentage of total expenditure",null,null,{"v":0.015,"d":"1.5%"},{"v":0.015,"d":"1.5%"},{"v":0.02,"d":"2.0%"},{"v":0.035,"d":"3.5%"},{"v":0.05,"d":"5.0%"}]
[null,"Secondary with sixth form","Small","Medium FSM","Spend on education support staff as a percentage of total expenditure",null,null,{"v":0.07,"d":"7.0%"},{"v":0.08,"d":"8.0%"},{"v":0.095,"d":"9.5%"},{"v":0.115,"d":"11.5%"},{"v":0.13,"d":"13.0%"}]
[null,"Secondary with sixth form","Small","Medium FSM","Spend on administrative and clerical staff as a percentage of total expenditure",{"$nulls":3},{"v":0.065,"d":"6.5%"},null,{"v":0.09,"d":"9.0%"},{"v":0.115,"d":"11.5%"}]
[null,"Secondary with sixth form","Small","Medium FSM","Spend on other staff costs as a percentage of total expenditure",{"$nulls":3},{"v":0.015,"d":"1.5%"},null,{"v":0.03,"d":"3.0%"},{"v":0.045,"d":"4.5%"}]
[null,"Secondary with sixth form","Small","Medium FSM","Spend on premises (including staff costs) as a percentage of total expenditure",{"$nulls":3},{"v":0.055,"d":"5.5%"},null,{"v":0.07,"d":"7.0%"},{"v":0.095,"d":"9.5%"}]
[null,"Secondary with sixth form","Small","Medium FSM","Spend on teaching resources as a percentage of total expenditure",{"v":0.04,"d":"4.0%"},{"v":0.05,"d":"5.0%"},{"v":0.06,"d":"6.0%"},{"v":0.065,"d":"6.5%"},{"v":0.07,"d":"7.0%"}]
[null,"Secondary with sixth form","Small","Medium FSM","Spend on energy as a percentage of total expenditure",{"$nulls":3},{"v":0.01,"d":"1.0%"},null,{"v":0.015,"d":"1.5%"},{"v":0.02,"d":"2.0%"}]
[null,"Secondary with sixth form","Small","Medium FSM","Senior leaders as a percentage of workforce",null,null,{"v":0.065,"d":"6.5%"},{"v":0.07,"d":"7.0%"},{"v":0.08,"d":"8.0%"},{"v":0.105,"d":"10.5%"},{"v":0.14,"d":"14.0%"}]
[null,"Secondary with sixth form","Small","Medium FSM","Pupil to teacher ratio",{"v":12,"d":"12.0"},13.5,14.5,{"v":15,"d":"15.0"},{"v":16,"d":"16.0"},{"v":17,"d":"17.0"},{"v":18,"d":"18.0"}]
[null,"Secondary with sixth form","Small","Medium FSM","Pupil to adult ratio",{"v":7,"d":"7.0"},{"v":8,"d":"8.0"},8.5,{"v":9,"d":"9.0"},9.5,{"v":10,"d":"10.0"},11.5]
[null,"Secondary with sixth form","Small","Medium FSM","Average class size",{"v":15,"d":"15.0"},16.5,18.5,{"v":19,"d":"19.0"},19.5,21.5,{"v":23,"d":"23.0"}]
[]
[522,"Secondary with sixth form","Medium","Medium FSM","SSMM"]
[null,"Secondary with sixth form","Medium","Medium FSM","Spend on teaching staff as a percentage of total expenditure",{"v":0.49,"d":"49.0%"},{"v":0.52,"d":"52.0%"},{"v":0.555,"d":"55.5%"},{"v":0.565,"d":"56.5%"},{"v":0.575,"d":"57.5%"},{"v":0.605,"d":"60.5%"},{"v":0.625,"d":"62.5%"}]
[null,"Secondary with sixth form","Medium","Medium FSM","Spend on supply staff as a percentage of total expenditure",null,null,{"v":0.015,"d":"1.5%"},{"v":0.015,"d":"1.5%"},{"v":0.02,"d":"2.0%"},{"v":0.03,"d":"3.0%"},{"v":0.04,"d":"4.0%"}]
[null,"Secondary with sixth form","Medium","Medium FSM","Spend on education support staff as a percentage of total expenditure",null,null,{"v":0.08,"d":"8.0%"},{"v":0.09,"d":"9.0%"},{"v":0.1,"d":"10.0%"},{"v":0.12,"d":"12.0%"},{"v":0.135,"d":"13.5%"}]
[null,"Secondary with sixth form","Medium","Medium FSM","Spend on administrative and clerical staff as a percentage of total expenditure",{"$nulls":3},{"v":0.065,"d":"6.5%"},null,{"v":0.085,"d":"8.5%"},{"v":0.1,"d":"10.0%"}]
[null,"Secondary with sixth form","Medium","Medium FSM","Spend on other staff costs as a percentage of total expenditure",{"$nulls":3},{"v":0.015,"d":"1.5%"},null,{"v":0.035,"d":"3.5%"},{"v":0.05,"d":"5.0%"}]
[null,"Secondary with sixth form","Medium","Medium FSM","Spend on premises (including staff costs) as a percentage of total expenditure",{"$nulls":3},{"v":0.055,"d":"5.5%"},null,{"v":0.07,"d":"7.0%"},{"v":0.08,"d":"8.0%"}]
[null,"Secondary with sixth form","Medium","Medium FSM","Spend on teaching resources as a percentage of total expenditure",{"v":0.045,"d":"4.5%"},{"v":0.05,"d":"5.0%"},{"v":0.06,"d":"6.0%"},{"v":0.065,"d":"6.5%"},{"v":0.07,"d":"7.0%"}]
[null,"Secondary with sixth form","Medium","Medium FSM","Spend on energy as a percentage of total expenditure",{"$nulls":3},{"v":0.01,"d":"1.0%"},null,{"v":0.015,"d":"1.5%"},{"v":0.02,"d":"2.0%"}]
[null,"Secondary with sixth form","Medium","Medium FSM","Senior leaders as a percentage of workforce",null,null,{"v":0.055,"d":"5.5%"},{"v":0.06,"d":"6.0%"},{"v":0.065,"d":"6.5%"},{"v":0.08,"d":"8.0%"},{"v":0.095,"d":"9.5%"}]
[null,"Secondary with sixth form","Medium","Medium FSM","Pupil to teacher ratio",{"v":14,"d":"14.0"},{"v":15,"d":"15.0"},15.5,{"v":16,"d":"16.0"},16.5,{"v":17,"d":"17.0"},{"v":18,"d":"18.0"}]
[null,"Secondary with sixth form","Medium","Medium FSM","Pupil to adult ratio",{"v":8,"d":"8.0"},8.5,9.5,9.5,{"v":10,"d":"10.0"},10.5,{"v":11,"d":"11.0"}]
[null,"Secondary with sixth form","Medium","Medium FSM","Average class size",18.5,19.5,{"v":20,"d":"20.0"},20.5,{"v":21,"d":"21.0"},{"v":22,"d":"22.0"},22.5]
[]
[276,"Secondary with sixth form","Large","Medium FSM","SSLM"]
[null,"Secondary with sixth form","Large","Medium FSM","Spend on teaching staff as a percentage of total expenditure",{"v":0.5,"d":"50.0%"},{"v":0.53,"d":"53.0%"},{"v":0.555,"d":"55.5%"},{"v":0.565,"d":"56.5%"},{"v":0.575,"d":"57.5%"},{"v":0.61,"d":"61.0%"},{"v":0.635,"d":"63.5%"}]
[null,"Secondary with sixth form","Large","Medium FSM","Spend on supply staff as a percentage of total expenditure",null,null,{"v":0.01,"d":"1.0%"},{"v":0.015,"d":"1.5%"},{"v":0.02,"d":"2.0%"},{"v":0.03,"d":"3.0%"},{"v":0.04,"d":"4.0%"}]
[null,"Secondary with sixth form","Large","Medium FSM","Spend on education support staff as a percentage of total expenditure",null,null,{"v":0.085,"d":"8.5%"},{"v":0.09,"d":"9.0%"},{"v":0.1,"d":"10.0%"},{"v":0.115,"d":"11.5%"},{"v":0.13,"d":"13.0%"}]
[null,"Secondary with sixth form","Large","Medium FSM","Spend on administrative and clerical staff as a percentage of total expenditure",{"$nulls":3},{"v":0.06,"d":"6.0%"},null,{"v":0.08,"d":"8.0%"},{"v":0.1,"d":"10.0%"}]
[null,"Secondary with sixth form","Large","Medium FSM","Spend on other staff costs as a percentage of total expenditure",{"$nulls":3},{"v":0.015,"d":"1.5%"},null,{"v":0.03,"d":"3.0%"},{"v":0.05,"d":"5.0%"}]
[null,"Secondary with sixth form","Large","Medium FSM","Spend on premises (including staff costs) as a percentage of total expenditure",{"$nulls":3},{"v":0.05,"d":"5.0%"},null,{"v":0.065,"d":"6.5%"},{"v":0.085,"d":"8.5%"}]
[null,"Secondary with sixth form","Large","Medium FSM","Spend on teaching resources as a percentage of total expenditure",{"v":0.045,"d":"4.5%"},{"v":0.055,"d":"5.5%"},{"v":0.065,"d":"6.5%"},{"v":0.07,"d":"7.0%"},{"v":0.075,"d":"7.5%"}]
[null,"Secondary with sixth form","Large","Medium FSM","Spend on energy as a percentage of total expenditure",{"$nulls":3},{"v":0.01,"d":"1.0%"},null,{"v":0.015,"d":"1.5%"},{"v":0.02,"d":"2.0%"}]
[null,"Secondary with sixth form","Large","Medium FSM","Senior leaders as a percentage of workforce",null,null,{"v":0.05,"d":"5.0%"},{"v":0.055,"d":"5.5%"},{"v":0.06,"d":"6.0%"},{"v":0.07,"d":"7.0%"},{"v":0.08,"d":"8.0%"}]
[null,"Secondary with sixth form","Large","Medium FSM","Pupil to teacher ratio",{"v":14,"d":"14.0"},{"v":15,"d":"15.0"},{"v":16,"d":"16.0"},{"v":16,"d":"16.0"},16.5,17.5,18.5]
[null,"Secondary with sixth form","Large","Medium FSM","Pupil to adult ratio",8.5,{"v":9,"d":"9.0"},9.5,{"v":10,"d":"10.0"},{"v":10,"d":"10.0"},{"v":11,"d":"11.0"},11.5]
[null,"Secondary with sixth form","Large","Medium FSM","Average class size",{"v":19,"d":"19.0"},19.5,20.5,{"v":21,"d":"21.0"},21.5,{"v":22,"d":"22.0"},{"v":23,"d":"23.0"}]
[]
[113,"Secondary without sixth form","Small","Medium FSM","SSM"]
[null,"Secondary without sixth form","Small","Medium FSM","Spend on teaching staff as a percentage of total expenditure",{"v":0.425,"d":"42.5%"},{"v":0.46,"d":"46.0%"},{"v":0.49,"d":"49.0%"},{"v":0.51,"d":"51.0%"},{"v":0.54,"d":"54.0%"},{"v":0.57,"d":"57.0%"},{"v":0.595,"d":"59.5%"}]
[null,"Secondary without sixth form","Small","Medium FSM","Spend on supply staff as a percentage of total expenditure",null,null,{"v":0.015,"d":"1.5%"},{"v":0.015,"d":"1.5%"},{"v":0.025,"d":"2.5%"},{"v":0.035,"d":"3.5%"},{"v":0.045,"d":"4.5%"}]
[null,"Secondary without sixth form","Small","Medium FSM","Spend on education support staff as a percentage of total expenditure",null,null,{"v":0.085,"d":"8.5%"},{"v":0.09,"d":"9.0%"},{"v":0.1,"d":"10.0%"},{"v":0.13,"d":"13.0%"},{"v":0.15,"d":"15.0%"}]
[null,"Secondary without sixth form","Small","Medium FSM","Spend on administrative and clerical staff as a percentage of total expenditure",{"$nulls":3},{"v":0.07,"d":"7.0%"},null,{"v":0.095,"d":"9.5%"},{"v":0.115,"d":"11.5%"}]
[null,"Secondary without sixth form","Small","Medium FSM","Spend on other staff costs as a percentage of total expenditure",{"$nulls":3},{"v":0.015,"d":"1.5%"},null,{"v":0.04,"d":"4.0%"},{"v":0.065,"d":"6.5%"}]
[null,"Secondary without sixth form","Small","Medium FSM","Spend on premises (including staff costs) as a percentage of total expenditure",{"$nulls":3},{"v":0.055,"d":"5.5%"},null,{"v":0.075,"d":"7.5%"},{"v":0.085,"d":"8.5%"}]
[null,"Secondary without sixth form","Small","Medium FSM","Spend on teaching resources as a percentage of total expenditure",{"v":0.035,"d":"3.5%"},{"v":0.04,"d":"4.0%"},{"v":0.055,"d":"5.5%"},{"v":0.06,"d":"6.0%"},{"v":0.07,"d":"7.0%"}]
[null,"Secondary without sixth form","Small","Medium FSM","Spend on energy as a percentage of total expenditure",{"$nulls":3},{"v":0.01,"d":"1.0%"},null,{"v":0.015,"d":"1.5%"},{"v":0.02,"d":"2.0%"}]
[null,"Secondary without sixth form","Small","Medium FSM","Senior leaders as a percentage of workforce",null,null,{"v":0.08,"d":"8.0%"},{"v":0.09,"d":"9.0%"},{"v":0.095,"d":"9.5%"},{"v":0.115,"d":"11.5%"},{"v":0.155,"d":"15.5%"}]
[null,"Secondary without sixth form","Small","Medium FSM","Pupil to teacher ratio",12.5,13.5,{"v":15,"d":"15.0"},15.5,16.5,17.5,{"v":19,"d":"19.0"}]
[null,"Secondary without sixth form","Small","Medium FSM","Pupil to adult ratio",6.5,7.5,8.5,{"v":9,"d":"9.0"},{"v":9,"d":"9.0"},{"v":10,"d":"10.0"},11.5]
[null,"Secondary without sixth form","Small","Medium FSM","Average class size",18.5,{"v":20,"d":"20.0"},{"v":22,"d":"22.0"},{"v":23,"d":"23.0"},23.5,{"v":25,"d":"25.0"},{"v":27,"d":"27.0"}]
[]
[180,"Secondary without sixth form","Medium","Medium FSM","SMM"]
[null,"Secondary without sixth form","Medium","Medium FSM","Spend on teaching staff as a percentage of total expenditure",{"v":0.465,"d":"46.5%"},{"v":0.495,"d":"49.5%"},{"v":0.525,"d":"52.5%"},{"v":0.535,"d":"53.5%"},{"v":0.545,"d":"54.5%"},{"v":0.57,"d":"57.0%"},{"v":0.595,"d":"59.5%"}]
[null,"Secondary without sixth form","Medium","Medium FSM","Spend on supply staff as a percentage of total expenditure",null,null,{"v":0.015,"d":"1.5%"},{"v":0.02,"d":"2.0%"},{"v":0.025,"d":"2.5%"},{"v":0.035,"d":"3.5%"},{"v":0.045,"d":"4.5%"}]
[null,"Secondary without sixth form","Medium","Medium FSM","Spend on education support staff as a percentage of total expenditure",null,null,{"v":0.095,"d":"9.5%"},{"v":0.11,"d":"11.0%"},{"v":0.115,"d":"11.5%"},{"v":0.135,"d":"13.5%"},{"v":0.15,"d":"15.0%"}]
[null,"Secondary without sixth form","Medium","Medium FSM","Spend on administrative and clerical staff as a percentage of total expenditure",{"$nulls":3},{"v":0.065,"d":"6.5%"},null,{"v":0.085,"d":"8.5%"},{"v":0.1,"d":"10.0%"}]
[null,"Secondary without sixth form","Medium","Medium FSM","Spend on other staff costs as a percentage of total expenditure",{"$nulls":3},{"v":0.015,"d":"1.5%"},null,{"v":0.035,"d":"3.5%"},{"v":0.05,"d":"5.0%"}]
[null,"Secondary without sixth form","Medium","Medium FSM","Spend on premises (including staff costs) as a percentage of total expenditure",{"$nulls":3},{"v":0.06,"d":"6.0%"},null,{"v":0.085,"d":"8.5%"},{"v":0.105,"d":"10.5%"}]
[null,"Secondary without sixth form","Medium","Medium FSM","Spend on teaching resources as a percentage of total expenditure",{"v":0.04,"d":"4.0%"},{"v":0.045,"d":"4.5%"},{"v":0.055,"d":"5.5%"},{"v":0.06,"d":"6.0%"},{"v":0.065,"d":"6.5%"}]
[null,"Secondary without sixth form","Medium","Medium FSM","Spend on energy as a percentage of total expenditure",{"$nulls":3},{"v":0.01,"d":"1.0%"},null,{"v":0.015,"d":"1.5%"},{"v":0.02,"d":"2.0%"}]
[null,"Secondary without sixth form","Medium","Medium FSM","Senior leaders as a percentage of workforce",null,null,{"v":0.06,"d":"6.0%"},{"v":0.07,"d":"7.0%"},{"v":0.075,"d":"7.5%"},{"v":0.09,"d":"9.0%"},{"v":0.105,"d":"10.5%"}]
[null,"Secondary without sixth form","Medium","Medium FSM","Pupil to teacher ratio",{"v":14,"d":"14.0"},14.5,15.5,{"v":16,"d":"16.0"},16.5,17.5,18.5]
[null,"Secondary without sixth form","Medium","Medium FSM","Pupil to adult ratio",7.5,{"v":8,"d":"8.0"},8.5,{"v":9,"d":"9.0"},{"v":9,"d":"9.0"},{"v":10,"d":"10.0"},{"v":11,"d":"11.0"}]
[null,"Secondary without sixth form","Medium","Medium FSM","Average class size",20.5,21.5,22.5,22.5,{"v":23,"d":"23.0"},{"v":24,"d":"24.0"},{"v":25,"d":"25.0"}]
[]
[101,"Secondary without sixth form","Large","Medium FSM","SLM"]
[null,"Secondary without sixth form","Large","Medium FSM","Spend on teaching staff as a percentage of total expenditure",{"v":0.46,"d":"46.0%"},{"v":0.48,"d":"48.0%"},{"v":0.51,"d":"51.0%"},{"v":0.525,"d":"52.5%"},{"v":0.54,"d":"54.0%"},{"v":0.57,"d":"57.0%"},{"v":0.59,"d":"59.0%"}]
[null,"Secondary without sixth form","Large","Medium FSM","Spend on supply staff as a percentage of total expenditure",null,null,{"v":0.015,"d":"1.5%"},{"v":0.02,"d":"2.0%"},{"v":0.025,"d":"2.5%"},{"v":0.035,"d":"3.5%"},{"v":0.045,"d":"4.5%"}]
[null,"Secondary without sixth form","Large","Medium FSM","Spend on education support staff as a percentage of total expenditure",null,null,{"v":0.105,"d":"10.5%"},{"v":0.11,"d":"11.0%"},{"v":0.12,"d":"12.0%"},{"v":0.14,"d":"14.0%"},{"v":0.15,"d":"15.0%"}]
[null,"Secondary without sixth form","Large","Medium FSM","Spend on administrative and clerical staff as a percentage of total expenditure",{"$nulls":3},{"v":0.06,"d":"6.0%"},null,{"v":0.08,"d":"8.0%"},{"v":0.1,"d":"10.0%"}]
[null,"Secondary without sixth form","Large","Medium FSM","Spend on other staff costs as a percentage of total expenditure",{"$nulls":3},{"v":0.015,"d":"1.5%"},null,{"v":0.03,"d":"3.0%"},{"v":0.055,"d":"5.5%"}]
[null,"Secondary without sixth form","Large","Medium FSM","Spend on premises (including staff costs) as a percentage of total expenditure",{"$nulls":3},{"v":0.055,"d":"5.5%"},null,{"v":0.07,"d":"7.0%"},{"v":0.09,"d":"9.0%"}]
[null,"Secondary without sixth form","Large","Medium FSM","Spend on teaching resources as a percentage of total expenditure",{"v":0.035,"d":"3.5%"},{"v":0.04,"d":"4.0%"},{"v":0.055,"d":"5.5%"},{"v":0.06,"d":"6.0%"},{"v":0.065,"d":"6.5%"}]
[null,"Secondary without sixth form","Large","Medium FSM","Spend on energy as a percentage of total expenditure",{"$nulls":3},{"v":0.01,"d":"1.0%"},null,{"v":0.015,"d":"1.5%"},{"v":0.02,"d":"2.0%"}]
[null,"Secondary without sixth form","Large","Medium FSM","Senior leaders as a percentage of workforce",null,null,{"v":0.055,"d":"5.5%"},{"v":0.06,"d":"6.0%"},{"v":0.065,"d":"6.5%"},{"v":0.075,"d":"7.5%"},{"v":0.095,"d":"9.5%"}]
[null,"Secondary without sixth form","Large","Medium FSM","Pupil to teacher ratio",{"v":14,"d":"14.0"},{"v":15,"d":"15.0"},{"v":16,"d":"16.0"},16.5,16.5,17.5,{"v":18,"d":"18.0"}]
[null,"Secondary without sixth form","Large","Medium FSM","Pupil to adult ratio",{"v":8,"d":"8.0"},8.5,{"v":9,"d":"9.0"},{"v":9,"d":"9.0"},9.5,{"v":10,"d":"10.0"},10.5]
[null,"Secondary without sixth form","Large","Medium FSM","Average class size",{"v":21,"d":"21.0"},{"v":22,"d":"22.0"},22.5,{"v":23,"d":"23.0"},23.5,24.5,25.5]
[]
[203,"Secondary with sixth form","Small","High FSM","SSSH"]
[null,"Secondary with sixth form","Small","High FSM","Spend on teaching staff as a percentage of total expenditure",{"v":0.44,"d":"44.0%"},{"v":0.47,"d":"47.0%"},{"v":0.505,"d":"50.5%"},{"v":0.52,"d":"52.0%"},{"v":0.53,"d":"53.0%"},{"v":0.56,"d":"56.0%"},{"v":0.595,"d":"59.5%"}]
[null,"Secondary with sixth form","Small","High FSM","Spend on supply staff as a percentage of total expenditure",null,null,{"v":0.015,"d":"1.5%"},{"v":0.02,"d":"2.0%"},{"v":0.025,"d":"2.5%"},{"v":0.04,"d":"4.0%"},{"v":0.055,"d":"5.5%"}]
[null,"Secondary with sixth form","Small","High FSM","Spend on education support staff as a percentage of total expenditure",null,null,{"v":0.09,"d":"9.0%"},{"v":0.1,"d":"10.0%"},{"v":0.105,"d":"10.5%"},{"v":0.13,"d":"13.0%"},{"v":0.15,"d":"15.0%"}]
[null,"Secondary with sixth form","Small","High FSM","Spend on administrative and clerical staff as a percentage of total expenditure",{"$nulls":3},{"v":0.07,"d":"7.0%"},null,{"v":0.105,"d":"10.5%"},{"v":0.12,"d":"12.0%"}]
[null,"Secondary with sixth form","Small","High FSM","Spend on other staff costs as a percentage of total expenditure",{"$nulls":3},{"v":0.02,"d":"2.0%"},null,{"v":0.035,"d":"3.5%"},{"v":0.05,"d":"5.0%"}]
[null,"Secondary with sixth form","Small","High FSM","Spend on premises (including staff costs) as a percentage of total expenditure",{"$nulls":3},{"v":0.055,"d":"5.5%"},null,{"v":0.075,"d":"7.5%"},{"v":0.085,"d":"8.5%"}]
[null,"Secondary with sixth form","Small","High FSM","Spend on teaching resources as a percentage of total expenditure",{"v":0.035,"d":"3.5%"},{"v":0.045,"d":"4.5%"},{"v":0.055,"d":"5.5%"},{"v":0.06,"d":"6.0%"},{"v":0.065,"d":"6.5%"}]
[null,"Secondary with sixth form","Small","High FSM","Spend on energy as a percentage of total expenditure",{"$nulls":3},{"v":0.01,"d":"1.0%"},null,{"v":0.015,"d":"1.5%"},{"v":0.02,"d":"2.0%"}]
[null,"Secondary with sixth form","Small","High FSM","Senior leaders as a percentage of workforce",null,null,{"v":0.07,"d":"7.0%"},{"v":0.075,"d":"7.5%"},{"v":0.08,"d":"8.0%"},{"v":0.1,"d":"10.0%"},{"v":0.115,"d":"11.5%"}]
[null,"Secondary with sixth form","Small","High FSM","Pupil to teacher ratio",{"v":12,"d":"12.0"},12.5,{"v":14,"d":"14.0"},14.5,{"v":15,"d":"15.0"},16.5,17.5]
[null,"Secondary with sixth form","Small","High FSM","Pupil to adult ratio",6.5,{"v":7,"d":"7.0"},{"v":8,"d":"8.0"},{"v":8,"d":"8.0"},8.5,9.5,{"v":10,"d":"10.0"}]
[null,"Secondary with sixth form","Small","High FSM","Average class size",{"v":16,"d":"16.0"},17.5,{"v":19,"d":"19.0"},19.5,{"v":20,"d":"20.0"},21.5,22.5]
[]
[269,"Secondary with sixth form","Medium","High FSM","SSMH"]
[null,"Secondary with sixth form","Medium","High FSM","Spend on teaching staff as a percentage of total expenditure",{"v":0.465,"d":"46.5%"},{"v":0.495,"d":"49.5%"},{"v":0.515,"d":"51.5%"},{"v":0.535,"d":"53.5%"},{"v":0.545,"d":"54.5%"},{"v":0.58,"d":"58.0%"},{"v":0.61,"d":"61.0%"}]
[null,"Secondary with sixth form","Medium","High FSM","Spend on supply staff as a percentage of total expenditure",null,null,{"v":0.015,"d":"1.5%"},{"v":0.02,"d":"2.0%"},{"v":0.025,"d":"2.5%"},{"v":0.035,"d":"3.5%"},{"v":0.045,"d":"4.5%"}]
[null,"Secondary with sixth form","Medium","High FSM","Spend on education support staff as a percentage of total expenditure",null,null,{"v":0.095,"d":"9.5%"},{"v":0.105,"d":"10.5%"},{"v":0.115,"d":"11.5%"},{"v":0.135,"d":"13.5%"},{"v":0.15,"d":"15.0%"}]
[null,"Secondary with sixth form","Medium","High FSM","Spend on administrative and clerical staff as a percentage of total expenditure",{"$nulls":3},{"v":0.06,"d":"6.0%"},null,{"v":0.085,"d":"8.5%"},{"v":0.105,"d":"10.5%"}]
[null,"Secondary with sixth form","Medium","High FSM","Spend on other staff costs as a percentage of total expenditure",{"$nulls":3},{"v":0.02,"d":"2.0%"},null,{"v":0.03,"d":"3.0%"},{"v":0.04,"d":"4.0%"}]
[null,"Secondary with sixth form","Medium","High FSM","Spend on premises (including staff costs) as a percentage of total expenditure",{"$nulls":3},{"v":0.055,"d":"5.5%"},null,{"v":0.075,"d":"7.5%"},{"v":0.095,"d":"9.5%"}]
[null,"Secondary with sixth form","Medium","High FSM","Spend on teaching resources as a percentage of total expenditure",{"v":0.04,"d":"4.0%"},{"v":0.045,"d":"4.5%"},{"v":0.055,"d":"5.5%"},{"v":0.06,"d":"6.0%"},{"v":0.065,"d":"6.5%"}]
[null,"Secondary with sixth form","Medium","High FSM","Spend on energy as a percentage of total expenditure",{"$nulls":3},{"v":0.01,"d":"1.0%"},null,{"v":0.015,"d":"1.5%"},{"v":0.02,"d":"2.0%"}]
[null,"Secondary with sixth form","Medium","High FSM","Senior leaders as a percentage of workforce",null,null,{"v":0.06,"d":"6.0%"},{"v":0.065,"d":"6.5%"},{"v":0.07,"d":"7.0%"},{"v":0.09,"d":"9.0%"},{"v":0.1,"d":"10.0%"}]
[null,"Secondary with sixth form","Medium","High FSM","Pupil to teacher ratio",12.5,{"v":13,"d":"13.0"},{"v":14,"d":"14.0"},14.5,{"v":15,"d":"15.0"},16.5,{"v":17,"d":"17.0"}]
[null,"Secondary with sixth form","Medium","High FSM","Pupil to adult ratio",{"v":7,"d":"7.0"},{"v":8,"d":"8.0"},8.5,{"v":9,"d":"9.0"},{"v":9,"d":"9.0"},9.5,10.5]
[null,"Secondary with sixth form","Medium","High FSM","Average class size",{"v":18,"d":"18.0"},18.5,19.5,{"v":20,"d":"20.0"},20.5,21.5,22.5]
[]
[64,"Secondary with sixth form","Large","High FSM","SSLH"]
[null,"Secondary with sixth form","Large","High FSM","Spend on teaching staff as a percentage of total expenditure",{"v":0.475,"d":"47.5%"},{"v":0.5,"d":"50.0%"},{"v":0.525,"d":"52.5%"},{"v":0.53,"d":"53.0%"},{"v":0.555,"d":"55.5%"},{"v":0.58,"d":"58.0%"},{"v":0.61,"d":"61.0%"}]
[null,"Secondary with sixth form","Large","High FSM","Spend on supply staff as a percentage of total expenditure",null,null,{"v":0.015,"d":"1.5%"},{"v":0.02,"d":"2.0%"},{"v":0.025,"d":"2.5%"},{"v":0.035,"d":"3.5%"},{"v":0.045,"d":"4.5%"}]
[null,"Secondary with sixth form","Large","High FSM","Spend on education support staff as a percentage of total expenditure",null,null,{"v":0.1,"d":"10.0%"},{"v":0.105,"d":"10.5%"},{"v":0.115,"d":"11.5%"},{"v":0.135,"d":"13.5%"},{"v":0.14,"d":"14.0%"}]
[null,"Secondary with sixth form","Large","High FSM","Spend on administrative and clerical staff as a percentage of total expenditure",{"$nulls":3},{"v":0.06,"d":"6.0%"},null,{"v":0.08,"d":"8.0%"},{"v":0.09,"d":"9.0%"}]
[null,"Secondary with sixth form","Large","High FSM","Spend on other staff costs as a percentage of total expenditure",{"$nulls":3},{"v":0.015,"d":"1.5%"},null,{"v":0.03,"d":"3.0%"},{"v":0.05,"d":"5.0%"}]
[null,"Secondary with sixth form","Large","High FSM","Spend on premises (including staff costs) as a percentage of total expenditure",{"$nulls":3},{"v":0.05,"d":"5.0%"},null,{"v":0.075,"d":"7.5%"},{"v":0.11,"d":"11.0%"}]
[null,"Secondary with sixth form","Large","High FSM","Spend on teaching resources as a percentage of total expenditure",{"v":0.04,"d":"4.0%"},{"v":0.05,"d":"5.0%"},{"v":0.055,"d":"5.5%"},{"v":0.06,"d":"6.0%"},{"v":0.06,"d":"6.0%"}]
[null,"Secondary with sixth form","Large","High FSM","Spend on energy as a percentage of total expenditure",{"$nulls":3},{"v":0.01,"d":"1.0%"},null,{"v":0.015,"d":"1.5%"},{"v":0.02,"d":"2.0%"}]
[null,"Secondary with sixth form","Large","High FSM","Senior leaders as a percentage of workforce",null,null,{"v":0.05,"d":"5.0%"},{"v":0.055,"d":"5.5%"},{"v":0.06,"d":"6.0%"},{"v":0.075,"d":"7.5%"},{"v":0.09,"d":"9.0%"}]
[null,"Secondary with sixth form","Large","High FSM","Pupil to teacher ratio",13.5,{"v":14,"d":"14.0"},{"v":15,"d":"15.0"},{"v":15,"d":"15.0"},15.5,16.5,{"v":17,"d":"17.0"}]
[null,"Secondary with sixth form","Large","High FSM","Pupil to adult ratio",7.5,8.5,{"v":9,"d":"9.0"},9.5,9.5,{"v":10,"d":"10.0"},10.5]
[null,"Secondary with sixth form","Large","High FSM","Average class size",18.5,{"v":19,"d":"19.0"},{"v":20,"d":"20.0"},20.5,20.5,{"v":22,"d":"22.0"},22.5]
[]
[51,"Secondary without sixth form","Small","High FSM","SSH"]
[null,"Secondary without sixth form","Small","High FSM","Spend on teaching staff as a percentage of total expenditure",{"v":0.4,"d":"40.0%"},{"v":0.425,"d":"42.5%"},{"v":0.465,"d":"46.5%"},{"v":0.485,"d":"48.5%"},{"v":0.5,"d":"50.0%"},{"v":0.53,"d":"53.0%"},{"v":0.575,"d":"57.5%"}]
[null,"Secondary without sixth form","Small","High FSM","Spend on supply staff as a percentage of total expenditure",null,null,{"v":0.015,"d":"1.5%"},{"v":0.025,"d":"2.5%"},{"v":0.03,"d":"3.0%"},{"v":0.045,"d":"4.5%"},{"v":0.065,"d":"6.5%"}]
[null,"Secondary without sixth form","Small","High FSM","Spend on education support staff as a percentage of total expenditure",null,null,{"v":0.09,"d":"9.0%"},{"v":0.1,"d":"10.0%"},{"v":0.115,"d":"11.5%"},{"v":0.14,"d":"14.0%"},{"v":0.165,"d":"16.5%"}]
[null,"Secondary without sixth form","Small","High FSM","Spend on administrative and clerical staff as a percentage of total expenditure",{"$nulls":3},{"v":0.075,"d":"7.5%"},null,{"v":0.105,"d":"10.5%"},{"v":0.115,"d":"11.5%"}]
[null,"Secondary without sixth form","Small","High FSM","Spend on other staff costs as a percentage of total expenditure",{"$nulls":3},{"v":0.015,"d":"1.5%"},null,{"v":0.035,"d":"3.5%"},{"v":0.05,"d":"5.0%"}]
[null,"Secondary without sixth form","Small","High FSM","Spend on premises (including staff costs) as a percentage of total expenditure",{"$nulls":3},{"v":0.065,"d":"6.5%"},null,{"v":0.085,"d":"8.5%"},{"v":0.095,"d":"9.5%"}]
[null,"Secondary without sixth form","Small","High FSM","Spend on teaching resources as a percentage of total expenditure",{"v":0.025,"d":"2.5%"},{"v":0.04,"d":"4.0%"},{"v":0.05,"d":"5.0%"},{"v":0.055,"d":"5.5%"},{"v":0.06,"d":"6.0%"}]
[null,"Secondary without sixth form","Small","High FSM","Spend on energy as a percentage of total expenditure",{"$nulls":3},{"v":0.01,"d":"1.0%"},null,{"v":0.015,"d":"1.5%"},{"v":0.02,"d":"2.0%"}]
[null,"Secondary without sixth form","Small","High FSM","Senior leaders as a percentage of workforce",null,null,{"v":0.08,"d":"8.0%"},{"v":0.085,"d":"8.5%"},{"v":0.095,"d":"9.5%"},{"v":0.125,"d":"12.5%"},{"v":0.14,"d":"14.0%"}]
[null,"Secondary without sixth form","Small","High FSM","Pupil to teacher ratio",10.5,{"v":12,"d":"12.0"},{"v":13,"d":"13.0"},13.5,{"v":14,"d":"14.0"},{"v":16,"d":"16.0"},{"v":17,"d":"17.0"}]
[null,"Secondary without sixth form","Small","High FSM","Pupil to adult ratio",5.5,6.5,{"v":7,"d":"7.0"},7.5,{"v":8,"d":"8.0"},{"v":9,"d":"9.0"},{"v":10,"d":"10.0"}]
[null,"Secondary without sixth form","Small","High FSM","Average class size",17.5,{"v":18,"d":"18.0"},20.5,{"v":21,"d":"21.0"},21.5,23.5,24.5]
[]
[114,"Secondary without sixth form","Medium","High FSM","SMH"]
[null,"Secondary without sixth form","Medium","High FSM","Spend on teaching staff as a percentage of total expenditure",{"v":0.44,"d":"44.0%"},{"v":0.465,"d":"46.5%"},{"v":0.49,"d":"49.0%"},{"v":0.505,"d":"50.5%"},{"v":0.515,"d":"51.5%"},{"v":0.55,"d":"55.0%"},{"v":0.58,"d":"58.0%"}]
[null,"Secondary without sixth form","Medium","High FSM","Spend on supply staff as a percentage of total expenditure",null,null,{"v":0.015,"d":"1.5%"},{"v":0.02,"d":"2.0%"},{"v":0.025,"d":"2.5%"},{"v":0.04,"d":"4.0%"},{"v":0.045,"d":"4.5%"}]
[null,"Secondary without sixth form","Medium","High FSM","Spend on education support staff as a percentage of total expenditure",null,null,{"v":0.105,"d":"10.5%"},{"v":0.11,"d":"11.0%"},{"v":0.12,"d":"12.0%"},{"v":0.14,"d":"14.0%"},{"v":0.16,"d":"16.0%"}]
[null,"Secondary without sixth form","Medium","High FSM","Spend on administrative and clerical staff as a percentage of total expenditure",{"$nulls":3},{"v":0.065,"d":"6.5%"},null,{"v":0.085,"d":"8.5%"},{"v":0.105,"d":"10.5%"}]
[null,"Secondary without sixth form","Medium","High FSM","Spend on other staff costs as a percentage of total expenditure",{"$nulls":3},{"v":0.015,"d":"1.5%"},null,{"v":0.03,"d":"3.0%"},{"v":0.045,"d":"4.5%"}]
[null,"Secondary without sixth form","Medium","High FSM","Spend on premises (including staff costs) as a percentage of total expenditure",{"$nulls":3},{"v":0.06,"d":"6.0%"},null,{"v":0.09,"d":"9.0%"},{"v":0.145,"d":"14.5%"}]
[null,"Secondary without sixth form","Medium","High FSM","Spend on teaching resources as a percentage of total expenditure",{"v":0.035,"d":"3.5%"},{"v":0.04,"d":"4.0%"},{"v":0.05,"d":"5.0%"},{"v":0.06,"d":"6.0%"},{"v":0.065,"d":"6.5%"}]
[null,"Secondary without sixth form","Medium","High FSM","Spend on energy as a percentage of total expenditure",{"$nulls":3},{"v":0.01,"d":"1.0%"},null,{"v":0.015,"d":"1.5%"},{"v":0.02,"d":"2.0%"}]
[null,"Secondary without sixth form","Medium","High FSM","Senior leaders as a percentage of workforce",null,null,{"v":0.065,"d":"6.5%"},{"v":0.07,"d":"7.0%"},{"v":0.075,"d":"7.5%"},{"v":0.095,"d":"9.5%"},{"v":0.105,"d":"10.5%"}]
[null,"Secondary without sixth form","Medium","High FSM","Pupil to teacher ratio",{"v":13,"d":"13.0"},{"v":14,"d":"14.0"},{"v":15,"d":"15.0"},{"v":15,"d":"15.0"},15.5,{"v":17,"d":"17.0"},{"v":18,"d":"18.0"}]
[null,"Secondary without sixth form","Medium","High FSM","Pupil to adult ratio",{"v":7,"d":"7.0"},7.5,{"v":8,"d":"8.0"},8.5,{"v":9,"d":"9.0"},9.5,{"v":10,"d":"10.0"}]
[null,"Secondary without sixth form","Medium","High FSM","Average class size",19.5,20.5,21.5,{"v":22,"d":"22.0"},22.5,23.5,{"v":24,"d":"24.0"}]
[]
[31,"Secondary without sixth form","Large","High FSM","SLH"]
[null,"Secondary without sixth form","Large","High FSM","Spend on teaching staff as a percentage of total expenditure",{"v":0.435,"d":"43.5%"},{"v":0.465,"d":"46.5%"},{"v":0.485,"d":"48.5%"},{"v":0.495,"d":"49.5%"},{"v":0.51,"d":"51.0%"},{"v":0.545,"d":"54.5%"},{"v":0.56,"d":"56.0%"}]
[null,"Secondary without sixth form","Large","High FSM","Spend on supply staff as a percentage of total expenditure",null,null,{"v":0.02,"d":"2.0%"},{"v":0.02,"d":"2.0%"},{"v":0.03,"d":"3.0%"},{"v":0.045,"d":"4.5%"},{"v":0.06,"d":"6.0%"}]
[null,"Secondary without sixth form","Large","High FSM","Spend on education support staff as a percentage of total expenditure",null,null,{"v":0.095,"d":"9.5%"},{"v":0.105,"d":"10.5%"},{"v":0.125,"d":"12.5%"},{"v":0.145,"d":"14.5%"},{"v":0.16,"d":"16.0%"}]
[null,"Secondary without sixth form","Large","High FSM","Spend on administrative and clerical staff as a percentage of total expenditure",{"$nulls":3},{"v":0.06,"d":"6.0%"},null,{"v":0.08,"d":"8.0%"},{"v":0.1,"d":"10.0%"}]
[null,"Secondary without sixth form","Large","High FSM","Spend on other staff costs as a percentage of total expenditure",{"$nulls":3},{"v":0.02,"d":"2.0%"},null,{"v":0.04,"d":"4.0%"},{"v":0.07,"d":"7.0%"}]
[null,"Secondary without sixth form","Large","High FSM","Spend on premises (including staff costs) as a percentage of total expenditure",{"$nulls":3},{"v":0.06,"d":"6.0%"},null,{"v":0.085,"d":"8.5%"},{"v":0.125,"d":"12.5%"}]
[null,"Secondary without sixth form","Large","High FSM","Spend on teaching resources as a percentage of total expenditure",{"v":0.04,"d":"4.0%"},{"v":0.05,"d":"5.0%"},{"v":0.055,"d":"5.5%"},{"v":0.06,"d":"6.0%"},{"v":0.06,"d":"6.0%"}]
[null,"Secondary without sixth form","Large","High FSM","Spend on energy as a percentage of total expenditure",{"$nulls":3},{"v":0.01,"d":"1.0%"},null,{"v":0.015,"d":"1.5%"},{"v":0.02,"d":"2.0%"}]
[null,"Secondary without sixth form","Large","High FSM","Senior leaders as a percentage of workforce",null,null,{"v":0.055,"d":"5.5%"},{"v":0.06,"d":"6.0%"},{"v":0.07,"d":"7.0%"},{"v":0.08,"d":"8.0%"},{"v":0.1,"d":"10.0%"}]
[null,"Secondary without sixth form","Large","High FSM","Pupil to teacher ratio",13.5,14.5,15.5,15.5,{"v":16,"d":"16.0"},17.5,19.5]
[null,"Secondary without sixth form","Large","High FSM","Pupil to adult ratio",{"v":7,"d":"7.0"},7.5,8.5,{"v":9,"d":"9.0"},{"v":9,"d":"9.0"},{"v":10,"d":"10.0"},{"v":11,"d":"11.0"}]
[null,"Secondary without sixth form","Large","High FSM","Average class size",{"v":20,"d":"20.0"},21.5,{"v":22,"d":"22.0"},{"v":23,"d":"23.0"},{"v":23,"d":"23.0"},{"v":24,"d":"24.0"},{"v":25,"d":"25.0"}]
[]
[]
["Sample size","Phase","London?","Note: all but average teacher cost are the same for type of school, despite the location",null,"Red if less than:","Amber if less than:","Dark green if between:","(Median)","and:","Amber if more than:","Red if more than:",null,"Light green for everything else"]
[127,"Special","London",null,"SPL"]
[null,"Special","London",null,"Spend on teaching staff as a percentage of total expenditure",{"v":0.27,"d":"27.0%"},{"v":0.3,"d":"30.0%"},{"v":0.345,"d":"34.5%"},{"v":0.36,"d":"36.0%"},{"v":0.38,"d":"38.0%"},{"v":0.43,"d":"43.0%"},{"v":0.47,"d":"47.0%"}]
[null,"Special","London",null,"Spend on supply staff as a percentage of total expenditure",null,null,{"v":0.015,"d":"1.5%"},{"v":0.02,"d":"2.0%"},{"v":0.025,"d":"2.5%"},{"v":0.045,"d":"4.5%"},{"v":0.07,"d":"7.0%"}]
[null,"Special","London",null,"Spend on education support staff as a percentage of total expenditure",null,null,{"v":0.29,"d":"29.0%"},{"v":0.32,"d":"32.0%"},{"v":0.34,"d":"34.0%"},{"v":0.39,"d":"39.0%"},{"v":0.415,"d":"41.5%"}]
[null,"Special","London",null,"Spend on administrative and clerical staff as a percentage of total expenditure",{"$nulls":3},{"v":0.045,"d":"4.5%"},null,{"v":0.065,"d":"6.5%"},{"v":0.08,"d":"8.0%"}]
[null,"Special","London",null,"Spend on other staff costs as a percentage of total expenditure",{"$nulls":3},{"v":0.03,"d":"3.0%"},null,{"v":0.05,"d":"5.0%"},{"v":0.07,"d":"7.0%"}]
[null,"Special","London",null,"Spend on premises (including staff costs) as a percentage of total expenditure",{"$nulls":3},{"v":0.05,"d":"5.0%"},null,{"v":0.065,"d":"6.5%"},{"v":0.08,"d":"8.0%"}]
[null,"Special","London",null,"Spend on teaching resources as a percentage of total expenditure",{"v":0.02,"d":"2.0%"},{"v":0.025,"d":"2.5%"},{"v":0.035,"d":"3.5%"},{"v":0.035,"d":"3.5%"},{"v":0.04,"d":"4.0%"}]
[null,"Special","London",null,"Spend on energy as a percentage of total expenditure",{"$nulls":3},{"v":0.01,"d":"1.0%"},null,{"v":0.015,"d":"1.5%"},{"v":0.02,"d":"2.0%"}]
[null,"Special","London",null,"Senior leaders as a percentage of workforce",null,null,{"v":0.05,"d":"5.0%"},{"v":0.055,"d":"5.5%"},{"v":0.065,"d":"6.5%"},{"v":0.085,"d":"8.5%"},{"v":0.105,"d":"10.5%"}]
[null,"Special","London",null,"Pupil to teacher ratio",{"v":4,"d":"4.0"},{"v":5,"d":"5.0"},{"v":6,"d":"6.0"},6.5,{"v":7,"d":"7.0"},7.5,8.5]
[null,"Special","London",null,"Pupil to adult ratio",1.3,1.5,1.7,{"v":2,"d":"2.0"},{"v":2,"d":"2.0"},2.5,2.7]
[null,"Special","London",null,"Average teacher cost (£)",{"v":52000,"d":"£52,000"},{"v":57000,"d":"£57,000"},{"v":62500,"d":"£62,500"},{"v":65000,"d":"£65,000"},{"v":67500,"d":"£67,500"},{"v":73000,"d":"£73,000"},{"v":78500,"d":"£78,500"}]
[]
[774,"Special","Non-London",null,"SPNL"]
[null,"Special","Non-London",null,"Spend on teaching staff as a percentage of total expenditure",{"v":0.27,"d":"27.0%"},{"v":0.3,"d":"30.0%"},{"v":0.345,"d":"34.5%"},{"v":0.36,"d":"36.0%"},{"v":0.38,"d":"38.0%"},{"v":0.43,"d":"43.0%"},{"v":0.47,"d":"47.0%"}]
[null,"Special","Non-London",null,"Spend on supply staff as a percentage of total expenditure",null,null,{"v":0.015,"d":"1.5%"},{"v":0.02,"d":"2.0%"},{"v":0.025,"d":"2.5%"},{"v":0.045,"d":"4.5%"},{"v":0.07,"d":"7.0%"}]
[null,"Special","Non-London",null,"Spend on education support staff as a percentage of total expenditure",null,null,{"v":0.29,"d":"29.0%"},{"v":0.32,"d":"32.0%"},{"v":0.34,"d":"34.0%"},{"v":0.39,"d":"39.0%"},{"v":0.415,"d":"41.5%"}]
[null,"Special","Non-London",null,"Spend on administrative and clerical staff as a percentage of total expenditure",{"$nulls":3},{"v":0.045,"d":"4.5%"},null,{"v":0.065,"d":"6.5%"},{"v":0.08,"d":"8.0%"}]
[null,"Special","Non-London",null,"Spend on other staff costs as a percentage of total expenditure",{"$nulls":3},{"v":0.03,"d":"3.0%"},null,{"v":0.05,"d":"5.0%"},{"v":0.07,"d":"7.0%"}]
[null,"Special","Non-London",null,"Spend on premises (including staff costs) as a percentage of total expenditure",{"$nulls":3},{"v":0.05,"d":"5.0%"},null,{"v":0.065,"d":"6.5%"},{"v":0.08,"d":"8.0%"}]
[null,"Special","Non-London",null,"Spend on teaching resources as a percentage of total expenditure",{"v":0.02,"d":"2.0%"},{"v":0.025,"d":"2.5%"},{"v":0.035,"d":"3.5%"},{"v":0.035,"d":"3.5%"},{"v":0.04,"d":"4.0%"}]
[null,"Special","Non-London",null,"Spend on energy as a percentage of total expenditure",{"$nulls":3},{"v":0.01,"d":"1.0%"},null,{"v":0.015,"d":"1.5%"},{"v":0.02,"d":"2.0%"}]
[null,"Special","Non-London",null,"Senior leaders as a percentage of workforce",null,null,{"v":0.05,"d":"5.0%"},{"v":0.055,"d":"5.5%"},{"v":0.065,"d":"6.5%"},{"v":0.085,"d":"8.5%"},{"v":0.105,"d":"10.5%"}]
[null,"Special","Non-London",null,"Pupil to teacher ratio",{"v":4,"d":"4.0"},{"v":5,"d":"5.0"},{"v":6,"d":"6.0"},6.5,{"v":7,"d":"7.0"},7.5,8.5]
[null,"Special","Non-London",null,"Pupil to adult ratio",1.3,1.5,1.7,{"v":2,"d":"2.0"},{"v":2,"d":"2.0"},2.5,2.7]
[null,"Special","Non-London",null,"Average teacher cost (£)",{"v":49500,"d":"£49,500"},{"v":53000,"d":"£53,000"},{"v":56000,"d":"£56,000"},{"v":58000,"d":"£58,000"},{"v":59500,"d":"£59,500"},{"v":63500,"d":"£63,500"},{"v":67000,"d":"£67,000"}]
[]
[48,"Alternative provision","London",null,"APL"]
[null,"Alternative provision","London",null,"Spend on teaching staff as a percentage of total expenditure",{"v":0.285,"d":"28.5%"},{"v":0.34,"d":"34.0%"},{"v":0.405,"d":"40.5%"},{"v":0.44,"d":"44.0%"},{"v":0.47,"d":"47.0%"},{"v":0.545,"d":"54.5%"},{"v":0.605,"d":"60.5%"}]
[null,"Alternative provision","London",null,"Spend on supply staff as a percentage of total expenditure",null,null,{"v":0.025,"d":"2.5%"},{"v":0.04,"d":"4.0%"},{"v":0.055,"d":"5.5%"},{"v":0.095,"d":"9.5%"},{"v":0.13,"d":"13.0%"}]
[null,"Alternative provision","London",null,"Spend on education support staff as a percentage of total expenditure",null,null,{"v":0.15,"d":"15.0%"},{"v":0.17,"d":"17.0%"},{"v":0.195,"d":"19.5%"},{"v":0.235,"d":"23.5%"},{"v":0.28,"d":"28.0%"}]
[null,"Alternative provision","London",null,"Spend on administrative and clerical staff as a percentage of total expenditure",{"$nulls":3},{"v":0.06,"d":"6.0%"},null,{"v":0.09,"d":"9.0%"},{"v":0.105,"d":"10.5%"}]
[null,"Alternative provision","London",null,"Spend on other staff costs as a percentage of total expenditure",{"$nulls":3},{"v":0.02,"d":"2.0%"},null,{"v":0.035,"d":"3.5%"},{"v":0.06,"d":"6.0%"}]
[null,"Alternative provision","London",null,"Spend on premises (including staff costs) as a percentage of total expenditure",{"$nulls":3},{"v":0.04,"d":"4.0%"},null,{"v":0.055,"d":"5.5%"},{"v":0.065,"d":"6.5%"}]
[null,"Alternative provision","London",null,"Spend on teaching resources as a percentage of total expenditure",{"v":0.02,"d":"2.0%"},{"v":0.025,"d":"2.5%"},{"v":0.035,"d":"3.5%"},{"v":0.045,"d":"4.5%"},{"v":0.055,"d":"5.5%"}]
[null,"Alternative provision","London",null,"Spend on energy as a percentage of total expenditure",{"$nulls":3},{"v":0.01,"d":"1.0%"},null,{"v":0.015,"d":"1.5%"},{"v":0.02,"d":"2.0%"}]
[null,"Alternative provision","London",null,"Senior leaders as a percentage of workforce",null,null,{"v":0.09,"d":"9.0%"},{"v":0.1,"d":"10.0%"},{"v":0.115,"d":"11.5%"},{"v":0.155,"d":"15.5%"},{"v":0.19,"d":"19.0%"}]
[null,"Alternative provision","London",null,"Pupil to teacher ratio",{"v":3,"d":"3.0"},3.5,4.5,{"v":5,"d":"5.0"},{"v":6,"d":"6.0"},{"v":8,"d":"8.0"},{"v":10,"d":"10.0"}]
[null,"Alternative provision","London",null,"Pupil to adult ratio",1.3,1.5,{"v":2,"d":"2.0"},2.5,2.5,3.5,{"v":4,"d":"4.0"}]
[null,"Alternative provision","London",null,"Average teacher cost (£)",{"v":43500,"d":"£43,500"},{"v":52500,"d":"£52,500"},{"v":61000,"d":"£61,000"},{"v":65500,"d":"£65,500"},{"v":67000,"d":"£67,000"},{"v":79000,"d":"£79,000"},{"v":87000,"d":"£87,000"}]
[]
[269,"Alternative provision","Non-London",null,"APNL"]
[null,"Alternative provision","Non-London",null,"Spend on teaching staff as a percentage of total expenditure",{"v":0.285,"d":"28.5%"},{"v":0.34,"d":"34.0%"},{"v":0.405,"d":"40.5%"},{"v":0.44,"d":"44.0%"},{"v":0.47,"d":"47.0%"},{"v":0.545,"d":"54.5%"},{"v":0.605,"d":"60.5%"}]
[null,"Alternative provision","Non-London",null,"Spend on supply staff as a percentage of total expenditure",null,null,{"v":0.025,"d":"2.5%"},{"v":0.04,"d":"4.0%"},{"v":0.055,"d":"5.5%"},{"v":0.095,"d":"9.5%"},{"v":0.13,"d":"13.0%"}]
[null,"Alternative provision","Non-London",null,"Spend on education support staff as a percentage of total expenditure",null,null,{"v":0.15,"d":"15.0%"},{"v":0.17,"d":"17.0%"},{"v":0.195,"d":"19.5%"},{"v":0.235,"d":"23.5%"},{"v":0.28,"d":"28.0%"}]
[null,"Alternative provision","Non-London",null,"Spend on administrative and clerical staff as a percentage of total expenditure",{"$nulls":3},{"v":0.06,"d":"6.0%"},null,{"v":0.09,"d":"9.0%"},{"v":0.105,"d":"10.5%"}]
[null,"Alternative provision","Non-London",null,"Spend on other staff costs as a percentage of total expenditure",{"$nulls":3},{"v":0.02,"d":"2.0%"},null,{"v":0.035,"d":"3.5%"},{"v":0.06,"d":"6.0%"}]
[null,"Alternative provision","Non-London",null,"Spend on premises (including staff costs) as a percentage of total expenditure",{"$nulls":3},{"v":0.04,"d":"4.0%"},null,{"v":0.055,"d":"5.5%"},{"v":0.065,"d":"6.5%"}]
[null,"Alternative provision","Non-London",null,"Spend on teaching resources as a percentage of total expenditure",{"v":0.02,"d":"2.0%"},{"v":0.025,"d":"2.5%"},{"v":0.035,"d":"3.5%"},{"v":0.045,"d":"4.5%"},{"v":0.055,"d":"5.5%"}]
[null,"Alternative provision","Non-London",null,"Spend on energy as a percentage of total expenditure",{"$nulls":3},{"v":0.01,"d":"1.0%"},null,{"v":0.015,"d":"1.5%"},{"v":0.02,"d":"2.0%"}]
[null,"Alternative provision","Non-London",null,"Senior leaders as a percentage of workforce",null,null,{"v":0.09,"d":"9.0%"},{"v":0.1,"d":"10.0%"},{"v":0.115,"d":"11.5%"},{"v":0.155,"d":"15.5%"},{"v":0.19,"d":"19.0%"}]
[null,"Alternative provision","Non-London",null,"Pupil to teacher ratio",{"v":3,"d":"3.0"},3.5,4.5,{"v":5,"d":"5.0"},{"v":6,"d":"6.0"},{"v":8,"d":"8.0"},{"v":10,"d":"10.0"}]
[null,"Alternative provision","Non-London",null,"Pupil to adult ratio",1.3,1.5,{"v":2,"d":"2.0"},2.5,2.5,3.5,{"v":4,"d":"4.0"}]
[null,"Alternative provision","Non-London",null,"Average teacher cost (£)",{"v":45000,"d":"£45,000"},{"v":52000,"d":"£52,000"},{"v":56500,"d":"£56,500"},{"v":59000,"d":"£59,000"},{"v":61000,"d":"£61,000"},{"v":67000,"d":"£67,000"},{"v":77000,"d":"£77,000"}]
[]
[47,"All-through","London",null,"ATL"]
[null,"All-through","London",null,"Spend on teaching staff as a percentage of total expenditure",{"v":0.405,"d":"40.5%"},{"v":0.45,"d":"45.0%"},{"v":0.5,"d":"50.0%"},{"v":0.52,"d":"52.0%"},{"v":0.535,"d":"53.5%"},{"v":0.59,"d":"59.0%"},{"v":0.61,"d":"61.0%"}]
[null,"All-through","London",null,"Spend on supply staff as a percentage of total expenditure",null,null,{"v":0.02,"d":"2.0%"},{"v":0.025,"d":"2.5%"},{"v":0.03,"d":"3.0%"},{"v":0.045,"d":"4.5%"},{"v":0.06,"d":"6.0%"}]
[null,"All-through","London",null,"Spend on education support staff as a percentage of total expenditure",null,null,{"v":0.105,"d":"10.5%"},{"v":0.115,"d":"11.5%"},{"v":0.125,"d":"12.5%"},{"v":0.155,"d":"15.5%"},{"v":0.18,"d":"18.0%"}]
[null,"All-through","London",null,"Spend on administrative and clerical staff as a percentage of total expenditure",{"$nulls":3},{"v":0.06,"d":"6.0%"},null,{"v":0.085,"d":"8.5%"},{"v":0.105,"d":"10.5%"}]
[null,"All-through","London",null,"Spend on other staff costs as a percentage of total expenditure",{"$nulls":3},{"v":0.02,"d":"2.0%"},null,{"v":0.035,"d":"3.5%"},{"v":0.055,"d":"5.5%"}]
[null,"All-through","London",null,"Spend on premises (including staff costs) as a percentage of total expenditure",{"$nulls":3},{"v":0.05,"d":"5.0%"},null,{"v":0.07,"d":"7.0%"},{"v":0.09,"d":"9.0%"}]
[null,"All-through","London",null,"Spend on teaching resources as a percentage of total expenditure",{"v":0.035,"d":"3.5%"},{"v":0.04,"d":"4.0%"},{"v":0.05,"d":"5.0%"},{"v":0.055,"d":"5.5%"},{"v":0.06,"d":"6.0%"}]
[null,"All-through","London",null,"Spend on energy as a percentage of total expenditure",{"$nulls":3},{"v":0.01,"d":"1.0%"},null,{"v":0.015,"d":"1.5%"},{"v":0.02,"d":"2.0%"}]
[null,"All-through","London",null,"Senior leaders as a percentage of workforce",null,null,{"v":0.065,"d":"6.5%"},{"v":0.07,"d":"7.0%"},{"v":0.075,"d":"7.5%"},{"v":0.1,"d":"10.0%"},{"v":0.11,"d":"11.0%"}]
[null,"All-through","London",null,"Pupil to teacher ratio",13.5,14.5,{"v":16,"d":"16.0"},16.5,{"v":17,"d":"17.0"},{"v":18,"d":"18.0"},{"v":19,"d":"19.0"}]
[null,"All-through","London",null,"Pupil to adult ratio",{"v":7,"d":"7.0"},7.5,8.5,{"v":9,"d":"9.0"},{"v":9,"d":"9.0"},{"v":10,"d":"10.0"},10.5]
[null,"All-through","London",null,"Average class size",{"v":19,"d":"19.0"},20.5,22.5,{"v":23,"d":"23.0"},23.5,{"v":25,"d":"25.0"},{"v":26,"d":"26.0"}]
[null,"All-through","London",null,"Average teacher cost (£)",{"v":53500,"d":"£53,500"},{"v":57000,"d":"£57,000"},{"v":62500,"d":"£62,500"},{"v":64000,"d":"£64,000"},{"v":66000,"d":"£66,000"},{"v":72000,"d":"£72,000"},{"v":76000,"d":"£76,000"}]
[]
[96,"All-through","Non-London",null,"ATNL"]
[null,"All-through","Non-London",null,"Spend on teaching staff as a percentage of total expenditure",{"v":0.405,"d":"40.5%"},{"v":0.45,"d":"45.0%"},{"v":0.5,"d":"50.0%"},{"v":0.52,"d":"52.0%"},{"v":0.535,"d":"53.5%"},{"v":0.59,"d":"59.0%"},{"v":0.61,"d":"61.0%"}]
[null,"All-through","Non-London",null,"Spend on supply staff as a percentage of total expenditure",null,null,{"v":0.02,"d":"2.0%"},{"v":0.025,"d":"2.5%"},{"v":0.03,"d":"3.0%"},{"v":0.045,"d":"4.5%"},{"v":0.06,"d":"6.0%"}]
[null,"All-through","Non-London",null,"Spend on education support staff as a percentage of total expenditure",null,null,{"v":0.105,"d":"10.5%"},{"v":0.115,"d":"11.5%"},{"v":0.125,"d":"12.5%"},{"v":0.155,"d":"15.5%"},{"v":0.18,"d":"18.0%"}]
[null,"All-through","Non-London",null,"Spend on administrative and clerical staff as a percentage of total expenditure",{"$nulls":3},{"v":0.06,"d":"6.0%"},null,{"v":0.085,"d":"8.5%"},{"v":0.105,"d":"10.5%"}]
[null,"All-through","Non-London",null,"Spend on other staff costs as a percentage of total expenditure",{"$nulls":3},{"v":0.02,"d":"2.0%"},null,{"v":0.035,"d":"3.5%"},{"v":0.055,"d":"5.5%"}]
[null,"All-through","Non-London",null,"Spend on premises (including staff costs) as a percentage of total expenditure",{"$nulls":3},{"v":0.05,"d":"5.0%"},null,{"v":0.07,"d":"7.0%"},{"v":0.09,"d":"9.0%"}]
[null,"All-through","Non-London",null,"Spend on teaching resources as a percentage of total expenditure",{"v":0.035,"d":"3.5%"},{"v":0.04,"d":"4.0%"},{"v":0.05,"d":"5.0%"},{"v":0.055,"d":"5.5%"},{"v":0.06,"d":"6.0%"}]
[null,"All-through","Non-London",null,"Spend on energy as a percentage of total expenditure",{"$nulls":3},{"v":0.01,"d":"1.0%"},null,{"v":0.015,"d":"1.5%"},{"v":0.02,"d":"2.0%"}]
[null,"All-through","Non-London",null,"Senior leaders as a percentage of workforce",null,null,{"v":0.065,"d":"6.5%"},{"v":0.07,"d":"7.0%"},{"v":0.075,"d":"7.5%"},{"v":0.1,"d":"10.0%"},{"v":0.11,"d":"11.0%"}]
[null,"All-through","Non-London",null,"Pupil to teacher ratio",13.5,14.5,{"v":16,"d":"16.0"},16.5,{"v":17,"d":"17.0"},{"v":18,"d":"18.0"},{"v":19,"d":"19.0"}]
[null,"All-through","Non-London",null,"Pupil to adult ratio",{"v":7,"d":"7.0"},7.5,8.5,{"v":9,"d":"9.0"},{"v":9,"d":"9.0"},{"v":10,"d":"10.0"},10.5]
[null,"All-through","Non-London",null,"Average class size",{"v":19,"d":"19.0"},20.5,22.5,{"v":23,"d":"23.0"},23.5,{"v":25,"d":"25.0"},{"v":26,"d":"26.0"}]
[null,"All-through","Non-London",null,"Average teacher cost (£)",{"v":43500,"d":"£43,500"},{"v":48500,"d":"£48,500"},{"v":52500,"d":"£52,500"},{"v":54000,"d":"£54,000"},{"v":56000,"d":"£56,000"},{"v":59500,"d":"£59,500"},{"v":63500,"d":"£63,500"}]
[]
[78,"Nursery","London",null,"NL"]
[null,"Nursery","London",null,"Spend on teaching staff as a percentage of total expenditure",{"v":0.16,"d":"16.0%"},{"v":0.195,"d":"19.5%"},{"v":0.245,"d":"24.5%"},{"v":0.26,"d":"26.0%"},{"v":0.29,"d":"29.0%"},{"v":0.34,"d":"34.0%"},{"v":0.38,"d":"38.0%"}]
[null,"Nursery","London",null,"Spend on supply staff as a percentage of total expenditure",null,null,{"v":0.005,"d":"0.5%"},{"v":0.01,"d":"1.0%"},{"v":0.015,"d":"1.5%"},{"v":0.03,"d":"3.0%"},{"v":0.05,"d":"5.0%"}]
[null,"Nursery","London",null,"Spend on education support staff as a percentage of total expenditure",null,null,{"v":0.295,"d":"29.5%"},{"v":0.335,"d":"33.5%"},{"v":0.36,"d":"36.0%"},{"v":0.43,"d":"43.0%"},{"v":0.475,"d":"47.5%"}]
[null,"Nursery","London",null,"Spend on administrative and clerical staff as a percentage of total expenditure",{"$nulls":3},{"v":0.065,"d":"6.5%"},null,{"v":0.095,"d":"9.5%"},{"v":0.115,"d":"11.5%"}]
[null,"Nursery","London",null,"Spend on other staff costs as a percentage of total expenditure",{"$nulls":3},{"v":0.03,"d":"3.0%"},null,{"v":0.055,"d":"5.5%"},{"v":0.08,"d":"8.0%"}]
[null,"Nursery","London",null,"Spend on premises (including staff costs) as a percentage of total expenditure",{"$nulls":3},{"v":0.05,"d":"5.0%"},null,{"v":0.07,"d":"7.0%"},{"v":0.09,"d":"9.0%"}]
[null,"Nursery","London",null,"Spend on teaching resources as a percentage of total expenditure",{"v":0.01,"d":"1.0%"},{"v":0.015,"d":"1.5%"},{"v":0.02,"d":"2.0%"},{"v":0.02,"d":"2.0%"},{"v":0.025,"d":"2.5%"}]
[null,"Nursery","London",null,"Spend on energy as a percentage of total expenditure",{"$nulls":3},{"v":0.01,"d":"1.0%"},null,{"v":0.015,"d":"1.5%"},{"v":0.02,"d":"2.0%"}]
[null,"Nursery","London",null,"Senior leaders as a percentage of workforce",null,null,{"v":0.085,"d":"8.5%"},{"v":0.095,"d":"9.5%"},{"v":0.105,"d":"10.5%"},{"v":0.14,"d":"14.0%"},{"v":0.175,"d":"17.5%"}]
[null,"Nursery","London",null,"Pupil to teacher ratio",13.5,{"v":16,"d":"16.0"},{"v":20,"d":"20.0"},21.5,{"v":23,"d":"23.0"},{"v":29,"d":"29.0"},{"v":34,"d":"34.0"}]
[null,"Nursery","London",null,"Pupil to adult ratio",{"v":3,"d":"3.0"},3.5,4.5,4.5,{"v":5,"d":"5.0"},{"v":6,"d":"6.0"},{"v":7,"d":"7.0"}]
[null,"Nursery","London",null,"Average teacher cost (£)",{"v":45500,"d":"£45,500"},{"v":55500,"d":"£55,500"},{"v":62500,"d":"£62,500"},{"v":66000,"d":"£66,000"},{"v":69000,"d":"£69,000"},{"v":77500,"d":"£77,500"},{"v":83000,"d":"£83,000"}]
[]
[315,"Nursery","Non-London",null,"NNL"]
[null,"Nursery","Non-London",null,"Spend on teaching staff as a percentage of total expenditure",{"v":0.16,"d":"16.0%"},{"v":0.195,"d":"19.5%"},{"v":0.245,"d":"24.5%"},{"v":0.26,"d":"26.0%"},{"v":0.29,"d":"29.0%"},{"v":0.34,"d":"34.0%"},{"v":0.38,"d":"38.0%"}]
[null,"Nursery","Non-London",null,"Spend on supply staff as a percentage of total expenditure",null,null,{"v":0.005,"d":"0.5%"},{"v":0.01,"d":"1.0%"},{"v":0.015,"d":"1.5%"},{"v":0.03,"d":"3.0%"},{"v":0.05,"d":"5.0%"}]
[null,"Nursery","Non-London",null,"Spend on education support staff as a percentage of total expenditure",null,null,{"v":0.295,"d":"29.5%"},{"v":0.335,"d":"33.5%"},{"v":0.36,"d":"36.0%"},{"v":0.43,"d":"43.0%"},{"v":0.475,"d":"47.5%"}]
[null,"Nursery","Non-London",null,"Spend on administrative and clerical staff as a percentage of total expenditure",{"$nulls":3},{"v":0.065,"d":"6.5%"},null,{"v":0.095,"d":"9.5%"},{"v":0.115,"d":"11.5%"}]
[null,"Nursery","Non-London",null,"Spend on other staff costs as a percentage of total expenditure",{"$nulls":3},{"v":0.03,"d":"3.0%"},null,{"v":0.055,"d":"5.5%"},{"v":0.08,"d":"8.0%"}]
[null,"Nursery","Non-London",null,"Spend on premises (including staff costs) as a percentage of total expenditure",{"$nulls":3},{"v":0.05,"d":"5.0%"},null,{"v":0.07,"d":"7.0%"},{"v":0.09,"d":"9.0%"}]
[null,"Nursery","Non-London",null,"Spend on teaching resources as a percentage of total expenditure",{"v":0.01,"d":"1.0%"},{"v":0.015,"d":"1.5%"},{"v":0.02,"d":"2.0%"},{"v":0.02,"d":"2.0%"},{"v":0.025,"d":"2.5%"}]
[null,"Nursery","Non-London",null,"Spend on energy as a percentage of total expenditure",{"$nulls":3},{"v":0.01,"d":"1.0%"},null,{"v":0.015,"d":"1.5%"},{"v":0.02,"d":"2.0%"}]
[null,"Nursery","Non-London",null,"Senior leaders as a percentage of workforce",null,null,{"v":0.085,"d":"8.5%"},{"v":0.095,"d":"9.5%"},{"v":0.105,"d":"10.5%"},{"v":0.14,"d":"14.0%"},{"v":0.175,"d":"17.5%"}]
[null,"Nursery","Non-London",null,"Pupil to teacher ratio",13.5,{"v":16,"d":"16.0"},{"v":20,"d":"20.0"},21.5,{"v":23,"d":"23.0"},{"v":29,"d":"29.0"},{"v":34,"d":"34.0"}]
[null,"Nursery","Non-London",null,"Pupil to adult ratio",{"v":3,"d":"3.0"},3.5,4.5,4.5,{"v":5,"d":"5.0"},{"v":6,"d":"6.0"},{"v":7,"d":"7.0"}]
[null,"Nursery","Non-London",null,"Average teacher cost (£)",{"v":44000,"d":"£44,000"},{"v":52500,"d":"£52,500"},{"v":56500,"d":"£56,500"},{"v":60000,"d":"£60,000"},{"v":62000,"d":"£62,000"},{"v":68000,"d":"£68,000"},{"v":72500,"d":"£72,500"}]
[]
["Sample size","Phase","London?","This shows the average teacher cost for primary and secondary schools. All others are above",null,"Red if less than:","Amber if less than:","Dark green if between:","(Median)","and:","Amber if more than:","Red if more than:",null,"Light green for everything else"]
[{"v":1721,"d":"1,721"},"Primary","London",null,"PL"]
[null,"Primary","London",null,"Average teacher cost (£)",{"v":49000,"d":"£49,000"},{"v":52000,"d":"£52,000"},{"v":56000,"d":"£56,000"},{"v":57500,"d":"£57,500"},{"v":59000,"d":"£59,000"},{"v":64000,"d":"£64,000"},{"v":68500,"d":"£68,500"}]
[]
[{"v":13651,"d":"13,651"},"Primary","Non-London",null,"PNL"]
[null,"Primary","Non-London",null,"Average teacher cost (£)",{"v":44000,"d":"£44,000"},{"v":47000,"d":"£47,000"},{"v":50000,"d":"£50,000"},{"v":51500,"d":"£51,500"},{"v":53000,"d":"£53,000"},{"v":56500,"d":"£56,500"},{"v":60000,"d":"£60,000"}]
[]
[328,"Secondary with sixth form","London",null,"SSLo"]
[null,"Secondary with sixth form","London",null,"Average teacher cost (£)",{"v":56000,"d":"£56,000"},{"v":59000,"d":"£59,000"},{"v":61500,"d":"£61,500"},{"v":63000,"d":"£63,000"},{"v":64500,"d":"£64,500"},{"v":68500,"d":"£68,500"},{"v":73000,"d":"£73,000"}]
[]
[{"v":1861,"d":"1,861"},"Secondary with sixth form","Non-London",null,"SSNL"]
[null,"Secondary with sixth form","Non-London",null,"Average teacher cost (£)",{"v":51000,"d":"£51,000"},{"v":53500,"d":"£53,500"},{"v":56000,"d":"£56,000"},{"v":57000,"d":"£57,000"},{"v":58000,"d":"£58,000"},{"v":60500,"d":"£60,500"},{"v":62500,"d":"£62,500"}]
[]
[96,"Secondary without sixth form","London",null,"SL"]
[null,"Secondary without sixth form","London",null,"Average teacher cost (£)",{"v":53500,"d":"£53,500"},{"v":58000,"d":"£58,000"},{"v":62500,"d":"£62,500"},{"v":64500,"d":"£64,500"},{"v":66500,"d":"£66,500"},{"v":71500,"d":"£71,500"},{"v":80000,"d":"£80,000"}]
[]
[678,"Secondary without sixth form","Non-London",null,"SNL"]
[null,"Secondary without sixth form","Non-London",null,"Average teacher cost (£)",{"v":50000,"d":"£50,000"},{"v":52500,"d":"£52,500"},{"v":55500,"d":"£55,500"},{"v":56500,"d":"£56,500"},{"v":57500,"d":"£57,500"},{"v":60500,"d":"£60,500"},{"v":65000,"d":"£65,000"}]

{"sheet":"Calcs","index":6,"n_rows":75,"n_cols":161,"rows_kept":75,"hidden":true}
[]
["RAG ratings for each school"]
[]
[null,null,1,{"$nulls":7},2,{"$nulls":7},3,{"$nulls":7},4,{"$nulls":7},5,{"$nulls":7},6,{"$nulls":7},7,{"$nulls":7},8,{"$nulls":7},9,{"$nulls":7},10,{"$nulls":7},11,{"$nulls":7},12,{"$nulls":7},13,{"$nulls":7},14,{"$nulls":7},15,{"$nulls":7},16,{"$nulls":7},17,{"$nulls":7},18,{"$nulls":7},19,{"$nulls":7},20]
[null,null,{"$f":"IF(Dashboard!H14=\"Primary\",\"P\",IF(Dashboard!H14=\"Secondary with sixth form\",\"SS\",IF(Dashboard!H14=\"Secondary without sixth form\",\"S\",IF(Dashboard!H14=\"Special\",\"SP\",IF(Dashboard!H14=\"Alternative provision\",\"AP\",IF(Dashboard!H14=\"All-through\",\"AT\",IF(Dashboard!H14=\"Nursery\",\"N\")))))))","v":"SS"},{"$nulls":7},{"$f":"IF(Dashboard!L14=\"Primary\",\"P\",IF(Dashboard!L14=\"Secondary with sixth form\",\"SS\",IF(Dashboard!L14=\"Secondary without sixth form\",\"S\",IF(Dashboard!L14=\"Special\",\"SP\",IF(Dashboard!L14=\"Alternative provision\",\"AP\",IF(Dashboard!L14=\"All-through\",\"AT\",IF(Dashboard!L14=\"Nursery\",\"N\")))))))","v":false},{"$nulls":7},{"$f":"IF(Dashboard!P14=\"Primary\",\"P\",IF(Dashboard!P14=\"Secondary with sixth form\",\"SS\",IF(Dashboard!P14=\"Secondary without sixth form\",\"S\",IF(Dashboard!P14=\"Special\",\"SP\",IF(Dashboard!P14=\"Alternative provision\",\"AP\",IF(Dashboard!P14=\"All-through\",\"AT\",IF(Dashboard!P14=\"Nursery\",\"N\")))))))","v":false},{"$nulls":7},{"$f":"IF(Dashboard!T14=\"Primary\",\"P\",IF(Dashboard!T14=\"Secondary with sixth form\",\"SS\",IF(Dashboard!T14=\"Secondary without sixth form\",\"S\",IF(Dashboard!T14=\"Special\",\"SP\",IF(Dashboard!T14=\"Alternative provision\",\"AP\",IF(Dashboard!T14=\"All-through\",\"AT\",IF(Dashboard!T14=\"Nursery\",\"N\")))))))","v":false},{"$nulls":7},{"$f":"IF(Dashboard!X14=\"Primary\",\"P\",IF(Dashboard!X14=\"Secondary with sixth form\",\"SS\",IF(Dashboard!X14=\"Secondary without sixth form\",\"S\",IF(Dashboard!X14=\"Special\",\"SP\",IF(Dashboard!X14=\"Alternative provision\",\"AP\",IF(Dashboard!X14=\"All-through\",\"AT\",IF(Dashboard!X14=\"Nursery\",\"N\")))))))","v":false},{"$nulls":7},{"$f":"IF(Dashboard!AB14=\"Primary\",\"P\",IF(Dashboard!AB14=\"Secondary with sixth form\",\"SS\",IF(Dashboard!AB14=\"Secondary without sixth form\",\"S\",IF(Dashboard!AB14=\"Special\",\"SP\",IF(Dashboard!AB14=\"Alternative provision\",\"AP\",IF(Dashboard!AB14=\"All-through\",\"AT\",IF(Dashboard!AB14=\"Nursery\",\"N\")))))))","v":false},{"$nulls":7},{"$f":"IF(Dashboard!AF14=\"Primary\",\"P\",IF(Dashboard!AF14=\"Secondary with sixth form\",\"SS\",IF(Dashboard!AF14=\"Secondary without sixth form\",\"S\",IF(Dashboard!AF14=\"Special\",\"SP\",IF(Dashboard!AF14=\"Alternative provision\",\"AP\",IF(Dashboard!AF14=\"All-through\",\"AT\",IF(Dashboard!AF14=\"Nursery\",\"N\")))))))","v":false},{"$nulls":7},{"$f":"IF(Dashboard!AJ14=\"Primary\",\"P\",IF(Dashboard!AJ14=\"Secondary with sixth form\",\"SS\",IF(Dashboard!AJ14=\"Secondary without sixth form\",\"S\",IF(Dashboard!AJ14=\"Special\",\"SP\",IF(Dashboard!AJ14=\"Alternative provision\",\"AP\",IF(Dashboard!AJ14=\"All-through\",\"AT\",IF(Dashboard!AJ14=\"Nursery\",\"N\")))))))","v":false},{"$nulls":7},{"$f":"IF(Dashboard!AN14=\"Primary\",\"P\",IF(Dashboard!AN14=\"Secondary with sixth form\",\"SS\",IF(Dashboard!AN14=\"Secondary without sixth form\",\"S\",IF(Dashboard!AN14=\"Special\",\"SP\",IF(Dashboard!AN14=\"Alternative provision\",\"AP\",IF(Dashboard!AN14=\"All-through\",\"AT\",IF(Dashboard!AN14=\"Nursery\",\"N\")))))))","v":false},{"$nulls":7},{"$f":"IF(Dashboard!AR14=\"Primary\",\"P\",IF(Dashboard!AR14=\"Secondary with sixth form\",\"SS\",IF(Dashboard!AR14=\"Secondary without sixth form\",\"S\",IF(Dashboard!AR14=\"Special\",\"SP\",IF(Dashboard!AR14=\"Alternative provision\",\"AP\",IF(Dashboard!AR14=\"All-through\",\"AT\",IF(Dashboard!AR14=\"Nursery\",\"N\")))))))","v":false},{"$nulls":7},{"$f":"IF(Dashboard!AV14=\"Primary\",\"P\",IF(Dashboard!AV14=\"Secondary with sixth form\",\"SS\",IF(Dashboard!AV14=\"Secondary without sixth form\",\"S\",IF(Dashboard!AV14=\"Special\",\"SP\",IF(Dashboard!AV14=\"Alternative provision\",\"AP\",IF(Dashboard!AV14=\"All-through\",\"AT\",IF(Dashboard!AV14=\"Nursery\",\"N\")))))))","v":false},{"$nulls":7},{"$f":"IF(Dashboard!AZ14=\"Primary\",\"P\",IF(Dashboard!AZ14=\"Secondary with sixth form\",\"SS\",IF(Dashboard!AZ14=\"Secondary without sixth form\",\"S\",IF(Dashboard!AZ14=\"Special\",\"SP\",IF(Dashboard!AZ14=\"Alternative provision\",\"AP\",IF(Dashboard!AZ14=\"All-through\",\"AT\",IF(Dashboard!AZ14=\"Nursery\",\"N\")))))))","v":false},{"$nulls":7},{"$f":"IF(Dashboard!BD14=\"Primary\",\"P\",IF(Dashboard!BD14=\"Secondary with sixth form\",\"SS\",IF(Dashboard!BD14=\"Secondary without sixth form\",\"S\",IF(Dashboard!BD14=\"Special\",\"SP\",IF(Dashboard!BD14=\"Alternative provision\",\"AP\",IF(Dashboard!BD14=\"All-through\",\"AT\",IF(Dashboard!BD14=\"Nursery\",\"N\")))))))","v":false},{"$nulls":7},{"$f":"IF(Dashboard!BH14=\"Primary\",\"P\",IF(Dashboard!BH14=\"Secondary with sixth form\",\"SS\",IF(Dashboard!BH14=\"Secondary without sixth form\",\"S\",IF(Dashboard!BH14=\"Special\",\"SP\",IF(Dashboard!BH14=\"Alternative provision\",\"AP\",IF(Dashboard!BH14=\"All-through\",\"AT\",IF(Dashboard!BH14=\"Nursery\",\"N\")))))))","v":false},{"$nulls":7},{"$f":"IF(Dashboard!BL14=\"Primary\",\"P\",IF(Dashboard!BL14=\"Secondary with sixth form\",\"SS\",IF(Dashboard!BL14=\"Secondary without sixth form\",\"S\",IF(Dashboard!BL14=\"Special\",\"SP\",IF(Dashboard!BL14=\"Alternative provision\",\"AP\",IF(Dashboard!BL14=\"All-through\",\"AT\",IF(Dashboard!BL14=\"Nursery\",\"N\")))))))","v":false},{"$nulls":7},{"$f":"IF(Dashboard!BP14=\"Primary\",\"P\",IF(Dashboard!BP14=\"Secondary with sixth form\",\"SS\",IF(Dashboard!BP14=\"Secondary without sixth form\",\"S\",IF(Dashboard!BP14=\"Special\",\"SP\",IF(Dashboard!BP14=\"Alternative provision\",\"AP\",IF(Dashboard!BP14=\"All-through\",\"AT\",IF(Dashboard!BP14=\"Nursery\",\"N\")))))))","v":false},{"$nulls":7},{"$f":"IF(Dashboard!BT14=\"Primary\",\"P\",IF(Dashboard!BT14=\"Secondary with sixth form\",\"SS\",IF(Dashboard!BT14=\"Secondary without sixth form\",\"S\",IF(Dashboard!BT14=\"Special\",\"SP\",IF(Dashboard!BT14=\"Alternative provision\",\"AP\",IF(Dashboard!BT14=\"All-through\",\"AT\",IF(Dashboard!BT14=\"Nursery\",\"N\")))))))","v":false},{"$nulls":7},{"$f":"IF(Dashboard!BX14=\"Primary\",\"P\",IF(Dashboard!BX14=\"Secondary with sixth form\",\"SS\",IF(Dashboard!BX14=\"Secondary without sixth form\",\"S\",IF(Dashboard!BX14=\"Special\",\"SP\",IF(Dashboard!BX14=\"Alternative provision\",\"AP\",IF(Dashboard!BX14=\"All-through\",\"AT\",IF(Dashboard!BX14=\"Nursery\",\"N\")))))))","v":false},{"$nulls":7},{"$f":"IF(Dashboard!CB14=\"Primary\",\"P\",IF(Dashboard!CB14=\"Secondary with sixth form\",\"SS\",IF(Dashboard!CB14=\"Secondary without sixth form\",\"S\",IF(Dashboard!CB14=\"Special\",\"SP\",IF(Dashboard!CB14=\"Alternative provision\",\"AP\",IF(Dashboard!CB14=\"All-through\",\"AT\",IF(Dashboard!CB14=\"Nursery\",\"N\")))))))","v":false},{"$nulls":7},{"$f":"IF(Dashboard!CF14=\"Primary\",\"P\",IF(Dashboard!CF14=\"Secondary with sixth form\",\"SS\",IF(Dashboard!CF14=\"Secondary without sixth form\",\"S\",IF(Dashboard!CF14=\"Special\",\"SP\",IF(Dashboard!CF14=\"Alternative provision\",\"AP\",IF(Dashboard!CF14=\"All-through\",\"AT\",IF(Dashboard!CF14=\"Nursery\",\"N\")))))))","v":false}]
[null,null,{"$f":"C5&\nIF($J29=\"very small\",\"VS\",IF($J29=\"small\",\"S\",IF($J29=\"medium\",\"M\",IF($J29=\"large\",\"L\"))))&\nIF($K29=\"low levels of FSM\",\"L\",IF($K29=\"medium levels of FSM\",\"M\",IF($K29=\"high levels of FSM\",\"H\")))","v":"SSLM"},{"$nulls":7},{"$f":"K5&\nIF($J30=\"very small\",\"VS\",IF($J30=\"small\",\"S\",IF($J30=\"medium\",\"M\",IF($J30=\"large\",\"L\"))))&\nIF($K30=\"low levels of FSM\",\"L\",IF($K30=\"medium levels of FSM\",\"M\",IF($K30=\"high levels of FSM\",\"H\")))","v":"FALSEFALSEFALSE"},{"$nulls":7},{"$f":"S5&\nIF($J31=\"very small\",\"VS\",IF($J31=\"small\",\"S\",IF($J31=\"medium\",\"M\",IF($J31=\"large\",\"L\"))))&\nIF($K31=\"low levels of FSM\",\"L\",IF($K31=\"medium levels of FSM\",\"M\",IF($K31=\"high levels of FSM\",\"H\")))","v":"FALSEFALSEFALSE"},{"$nulls":7},{"$f":"AA5&\nIF($J32=\"very small\",\"VS\",IF($J32=\"small\",\"S\",IF($J32=\"medium\",\"M\",IF($J32=\"large\",\"L\"))))&\nIF($K32=\"low levels of FSM\",\"L\",IF($K32=\"medium levels of FSM\",\"M\",IF($K32=\"high levels of FSM\",\"H\")))","v":"FALSEFALSEFALSE"},{"$nulls":7},{"$f":"AI5&\nIF($J33=\"very small\",\"VS\",IF($J33=\"small\",\"S\",IF($J33=\"medium\",\"M\",IF($J33=\"large\",\"L\"))))&\nIF($K33=\"low levels of FSM\",\"L\",IF($K33=\"medium levels of FSM\",\"M\",IF($K33=\"high levels of FSM\",\"H\")))","v":"FALSEFALSEFALSE"},{"$nulls":7},{"$f":"AQ5&\nIF($J34=\"very small\",\"VS\",IF($J34=\"small\",\"S\",IF($J34=\"medium\",\"M\",IF($J34=\"large\",\"L\"))))&\nIF($K34=\"low levels of FSM\",\"L\",IF($K34=\"medium levels of FSM\",\"M\",IF($K34=\"high levels of FSM\",\"H\")))","v":"FALSEFALSEFALSE"},{"$nulls":7},{"$f":"AY5&\nIF($J35=\"very small\",\"VS\",IF($J35=\"small\",\"S\",IF($J35=\"medium\",\"M\",IF($J35=\"large\",\"L\"))))&\nIF($K35=\"low levels of FSM\",\"L\",IF($K35=\"medium levels of FSM\",\"M\",IF($K35=\"high levels of FSM\",\"H\")))","v":"FALSEFALSEFALSE"},{"$nulls":7},{"$f":"BG5&\nIF($J36=\"very small\",\"VS\",IF($J36=\"small\",\"S\",IF($J36=\"medium\",\"M\",IF($J36=\"large\",\"L\"))))&\nIF($K36=\"low levels of FSM\",\"L\",IF($K36=\"medium levels of FSM\",\"M\",IF($K36=\"high levels of FSM\",\"H\")))","v":"FALSEFALSEFALSE"},{"$nulls":7},{"$f":"BO5&\nIF($J37=\"very small\",\"VS\",IF($J37=\"small\",\"S\",IF($J37=\"medium\",\"M\",IF($J37=\"large\",\"L\"))))&\nIF($K37=\"low levels of FSM\",\"L\",IF($K37=\"medium levels of FSM\",\"M\",IF($K37=\"high levels of FSM\",\"H\")))","v":"FALSEFALSEFALSE"},{"$nulls":7},{"$f":"BW5&\nIF($J38=\"very small\",\"VS\",IF($J38=\"small\",\"S\",IF($J38=\"medium\",\"M\",IF($J38=\"large\",\"L\"))))&\nIF($K38=\"low levels of FSM\",\"L\",IF($K38=\"medium levels of FSM\",\"M\",IF($K38=\"high levels of FSM\",\"H\")))","v":"FALSEFALSEFALSE"},{"$nulls":7},{"$f":"CE5&\nIF($J39=\"very small\",\"VS\",IF($J39=\"small\",\"S\",IF($J39=\"medium\",\"M\",IF($J39=\"large\",\"L\"))))&\nIF($K39=\"low levels of FSM\",\"L\",IF($K39=\"medium levels of FSM\",\"M\",IF($K39=\"high levels of FSM\",\"H\")))","v":"FALSEFALSEFALSE"},{"$nulls":7},{"$f":"CM5&\nIF($J40=\"very small\",\"VS\",IF($J40=\"small\",\"S\",IF($J40=\"medium\",\"M\",IF($J40=\"large\",\"L\"))))&\nIF($K40=\"low levels of FSM\",\"L\",IF($K40=\"medium levels of FSM\",\"M\",IF($K40=\"high levels of FSM\",\"H\")))","v":"FALSEFALSEFALSE"},{"$nulls":7},{"$f":"CU5&\nIF($J41=\"very small\",\"VS\",IF($J41=\"small\",\"S\",IF($J41=\"medium\",\"M\",IF($J41=\"large\",\"L\"))))&\nIF($K41=\"low levels of FSM\",\"L\",IF($K41=\"medium levels of FSM\",\"M\",IF($K41=\"high levels of FSM\",\"H\")))","v":"FALSEFALSEFALSE"},{"$nulls":7},{"$f":"DC5&\nIF($J42=\"very small\",\"VS\",IF($J42=\"small\",\"S\",IF($J42=\"medium\",\"M\",IF($J42=\"large\",\"L\"))))&\nIF($K42=\"low levels of FSM\",\"L\",IF($K42=\"medium levels of FSM\",\"M\",IF($K42=\"high levels of FSM\",\"H\")))","v":"FALSEFALSEFALSE"},{"$nulls":7},{"$f":"DK5&\nIF($J43=\"very small\",\"VS\",IF($J43=\"small\",\"S\",IF($J43=\"medium\",\"M\",IF($J43=\"large\",\"L\"))))&\nIF($K43=\"low levels of FSM\",\"L\",IF($K43=\"medium levels of FSM\",\"M\",IF($K43=\"high levels of FSM\",\"H\")))","v":"FALSEFALSEFALSE"},{"$nulls":7},{"$f":"DS5&\nIF($J44=\"very small\",\"VS\",IF($J44=\"small\",\"S\",IF($J44=\"medium\",\"M\",IF($J44=\"large\",\"L\"))))&\nIF($K44=\"low levels of FSM\",\"L\",IF($K44=\"medium levels of FSM\",\"M\",IF($K44=\"high levels of FSM\",\"H\")))","v":"FALSEFALSEFALSE"},{"$nulls":7},{"$f":"EA5&\nIF($J45=\"very small\",\"VS\",IF($J45=\"small\",\"S\",IF($J45=\"medium\",\"M\",IF($J45=\"large\",\"L\"))))&\nIF($K45=\"low levels of FSM\",\"L\",IF($K45=\"medium levels of FSM\",\"M\",IF($K45=\"high levels of FSM\",\"H\")))","v":"FALSEFALSEFALSE"},{"$nulls":7},{"$f":"EI5&\nIF($J46=\"very small\",\"VS\",IF($J46=\"small\",\"S\",IF($J46=\"medium\",\"M\",IF($J46=\"large\",\"L\"))))&\nIF($K46=\"low levels of FSM\",\"L\",IF($K46=\"medium levels of FSM\",\"M\",IF($K46=\"high levels of FSM\",\"H\")))","v":"FALSEFALSEFALSE"},{"$nulls":7},{"$f":"EQ5&\nIF($J47=\"very small\",\"VS\",IF($J47=\"small\",\"S\",IF($J47=\"medium\",\"M\",IF($J47=\"large\",\"L\"))))&\nIF($K47=\"low levels of FSM\",\"L\",IF($K47=\"medium levels of FSM\",\"M\",IF($K47=\"high levels of FSM\",\"H\")))","v":"FALSEFALSEFALSE"},{"$nulls":7},{"$f":"EY5&\nIF($J48=\"very small\",\"VS\",IF($J48=\"small\",\"S\",IF($J48=\"medium\",\"M\",IF($J48=\"large\",\"L\"))))&\nIF($K48=\"low levels of FSM\",\"L\",IF($K48=\"medium levels of FSM\",\"M\",IF($K48=\"high levels of FSM\",\"H\")))","v":"FALSEFALSEFALSE"}]
[null,null,{"$f":"C5&\nIF(AND(C5=\"SS\",$I29=\"in London\"),\"Lo\",IF($I29=\"in London\",\"L\",IF($I29=\"outside London\",\"NL\")))","v":"SSNL"},{"$nulls":7},{"$f":"K5&\nIF(AND(K5=\"SS\",$I30=\"in London\"),\"Lo\",IF($I30=\"in London\",\"L\",IF($I30=\"outside London\",\"NL\")))","v":"FALSEFALSE"},{"$nulls":7},{"$f":"S5&\nIF(AND(S5=\"SS\",$I31=\"in London\"),\"Lo\",IF($I31=\"in London\",\"L\",IF($I31=\"outside London\",\"NL\")))","v":"FALSEFALSE"},{"$nulls":7},{"$f":"AA5&\nIF(AND(AA5=\"SS\",$I32=\"in London\"),\"Lo\",IF($I32=\"in London\",\"L\",IF($I32=\"outside London\",\"NL\")))","v":"FALSEFALSE"},{"$nulls":7},{"$f":"AI5&\nIF(AND(AI5=\"SS\",$I33=\"in London\"),\"Lo\",IF($I33=\"in London\",\"L\",IF($I33=\"outside London\",\"NL\")))","v":"FALSEFALSE"},{"$nulls":7},{"$f":"AQ5&\nIF(AND(AQ5=\"SS\",$I34=\"in London\"),\"Lo\",IF($I34=\"in London\",\"L\",IF($I34=\"outside London\",\"NL\")))","v":"FALSEFALSE"},{"$nulls":7},{"$f":"AY5&\nIF(AND(AY5=\"SS\",$I35=\"in London\"),\"Lo\",IF($I35=\"in London\",\"L\",IF($I35=\"outside London\",\"NL\")))","v":"FALSEFALSE"},{"$nulls":7},{"$f":"BG5&\nIF(AND(BG5=\"SS\",$I36=\"in London\"),\"Lo\",IF($I36=\"in London\",\"L\",IF($I36=\"outside London\",\"NL\")))","v":"FALSEFALSE"},{"$nulls":7},{"$f":"BO5&\nIF(AND(BO5=\"SS\",$I37=\"in London\"),\"Lo\",IF($I37=\"in London\",\"L\",IF($I37=\"outside London\",\"NL\")))","v":"FALSEFALSE"},{"$nulls":7},{"$f":"BW5&\nIF(AND(BW5=\"SS\",$I38=\"in London\"),\"Lo\",IF($I38=\"in London\",\"L\",IF($I38=\"outside London\",\"NL\")))","v":"FALSEFALSE"},{"$nulls":7},{"$f":"CE5&\nIF(AND(CE5=\"SS\",$I39=\"in London\"),\"Lo\",IF($I39=\"in London\",\"L\",IF($I39=\"outside London\",\"NL\")))","v":"FALSEFALSE"},{"$nulls":7},{"$f":"CM5&\nIF(AND(CM5=\"SS\",$I40=\"in London\"),\"Lo\",IF($I40=\"in London\",\"L\",IF($I40=\"outside London\",\"NL\")))","v":"FALSEFALSE"},{"$nulls":7},{"$f":"CU5&\nIF(AND(CU5=\"SS\",$I41=\"in London\"),\"Lo\",IF($I41=\"in London\",\"L\",IF($I41=\"outside London\",\"NL\")))","v":"FALSEFALSE"},{"$nulls":7},{"$f":"DC5&\nIF(AND(DC5=\"SS\",$I42=\"in London\"),\"Lo\",IF($I42=\"in London\",\"L\",IF($I42=\"outside London\",\"NL\")))","v":"FALSEFALSE"},{"$nulls":7},{"$f":"DK5&\nIF(AND(DK5=\"SS\",$I43=\"in London\"),\"Lo\",IF($I43=\"in London\",\"L\",IF($I43=\"outside London\",\"NL\")))","v":"FALSEFALSE"},{"$nulls":7},{"$f":"DS5&\nIF(AND(DS5=\"SS\",$I44=\"in London\"),\"Lo\",IF($I44=\"in London\",\"L\",IF($I44=\"outside London\",\"NL\")))","v":"FALSEFALSE"},{"$nulls":7},{"$f":"EA5&\nIF(AND(EA5=\"SS\",$I45=\"in London\"),\"Lo\",IF($I45=\"in London\",\"L\",IF($I45=\"outside London\",\"NL\")))","v":"FALSEFALSE"},{"$nulls":7},{"$f":"EI5&\nIF(AND(EI5=\"SS\",$I46=\"in London\"),\"Lo\",IF($I46=\"in London\",\"L\",IF($I46=\"outside London\",\"NL\")))","v":"FALSEFALSE"},{"$nulls":7},{"$f":"EQ5&\nIF(AND(EQ5=\"SS\",$I47=\"in London\"),\"Lo\",IF($I47=\"in London\",\"L\",IF($I47=\"outside London\",\"NL\")))","v":"FALSEFALSE"},{"$nulls":7},{"$f":"EY5&\nIF(AND(EY5=\"SS\",$I48=\"in London\"),\"Lo\",IF($I48=\"in London\",\"L\",IF($I48=\"outside London\",\"NL\")))","v":"FALSEFALSE"}]
[null,null,1,2,3,4,5,6,7,null,1,2,3,4,5,6,7,null,1,2,3,4,5,6,7,null,1,2,3,4,5,6,7,null,1,2,3,4,5,6,7,null,1,2,3,4,5,6,7,null,1,2,3,4,5,6,7,null,1,2,3,4,5,6,7,null,1,2,3,4,5,6,7,null,1,2,3,4,5,6,7,null,1,2,3,4,5,6,7,null,1,2,3,4,5,6,7,null,1,2,3,4,5,6,7,null,1,2,3,4,5,6,7,null,1,2,3,4,5,6,7,null,1,2,3,4,5,6,7,null,1,2,3,4,5,6,7,null,1,2,3,4,5,6,7,null,1,2,3,4,5,6,7,null,1,2,3,4,5,6,7]
["Spend on teaching staff as a percentage of total expenditure",1,{"$f":"IF(OR($C$5=\"P\",$C$5=\"SS\",$C$5=\"S\"),INDEX(INDIRECT($C$6),$B9,C$8),\nIF(OR($C$5=\"N\",$C$5=\"AP\",$C$5=\"AT\",$C$5=\"SP\"),INDEX(INDIRECT($C$7),$B9,C$8)))","v":{"v":0.5,"d":"50.0%"}},{"v":0.53,"d":"53.0%"},{"v":0.555,"d":"55.5%"},{"v":0.565,"d":"56.5%"},{"v":0.575,"d":"57.5%"},{"v":0.61,"d":"61.0%"},{"v":0.635,"d":"63.5%"},null,{"$f":"IF(OR($K$5=\"P\",$K$5=\"SS\",$K$5=\"S\"),INDEX(INDIRECT($K$6),$B9,K$8),\nIF(OR($K$5=\"N\",$K$5=\"AP\",$K$5=\"AT\",$K$5=\"SP\"),INDEX(INDIRECT($K$7),$B9,K$8)))","v":false},false,false,false,false,false,false,null,{"$f":"IF(OR($S$5=\"P\",$S$5=\"SS\",$S$5=\"S\"),INDEX(INDIRECT($S$6),$B9,S$8),\nIF(OR($S$5=\"N\",$S$5=\"AP\",$S$5=\"AT\",$S$5=\"SP\"),INDEX(INDIRECT($S$7),$B9,S$8)))","v":false},false,false,false,false,false,false,null,{"$f":"IF(OR($AA$5=\"P\",$AA$5=\"SS\",$AA$5=\"S\"),INDEX(INDIRECT($AA$6),$B9,AA$8),\nIF(OR($AA$5=\"N\",$AA$5=\"AP\",$AA$5=\"AT\",$AA$5=\"SP\"),INDEX(INDIRECT($AA$7),$B9,AA$8)))","v":false},false,false,false,false,false,false,null,{"$f":"IF(OR($AI$5=\"P\",$AI$5=\"SS\",$AI$5=\"S\"),INDEX(INDIRECT($AI$6),$B9,AI$8),\nIF(OR($AI$5=\"N\",$AI$5=\"AP\",$AI$5=\"AT\",$AI$5=\"SP\"),INDEX(INDIRECT($AI$7),$B9,AI$8)))","v":false},false,false,false,false,false,false,null,{"$f":"IF(OR($AQ$5=\"P\",$AQ$5=\"SS\",$AQ$5=\"S\"),INDEX(INDIRECT($AQ$6),$B9,AQ$8),\nIF(OR($AQ$5=\"N\",$AQ$5=\"AP\",$AQ$5=\"AT\",$AQ$5=\"SP\"),INDEX(INDIRECT($AQ$7),$B9,AQ$8)))","v":false},false,false,false,false,false,false,null,{"$f":"IF(OR($AY$5=\"P\",$AY$5=\"SS\",$AY$5=\"S\"),INDEX(INDIRECT($AY$6),$B9,AY$8),\nIF(OR($AY$5=\"N\",$AY$5=\"AP\",$AY$5=\"AT\",$AY$5=\"SP\"),INDEX(INDIRECT($AY$7),$B9,AY$8)))","v":false},false,false,false,false,false,false,null,{"$f":"IF(OR($BG$5=\"P\",$BG$5=\"SS\",$BG$5=\"S\"),INDEX(INDIRECT($BG$6),$B9,BG$8),\nIF(OR($BG$5=\"N\",$BG$5=\"AP\",$BG$5=\"AT\",$BG$5=\"SP\"),INDEX(INDIRECT($BG$7),$B9,BG$8)))","v":false},false,false,false,false,false,false,null,{"$f":"IF(OR($BO$5=\"P\",$BO$5=\"SS\",$BO$5=\"S\"),INDEX(INDIRECT($BO$6),$B9,BO$8),\nIF(OR($BO$5=\"N\",$BO$5=\"AP\",$BO$5=\"AT\",$BO$5=\"SP\"),INDEX(INDIRECT($BO$7),$B9,BO$8)))","v":false},false,false,false,false,false,false,null,{"$f":"IF(OR($BW$5=\"P\",$BW$5=\"SS\",$BW$5=\"S\"),INDEX(INDIRECT($BW$6),$B9,BW$8),\nIF(OR($BW$5=\"N\",$BW$5=\"AP\",$BW$5=\"AT\",$BW$5=\"SP\"),INDEX(INDIRECT($BW$7),$B9,BW$8)))","v":false},false,false,false,false,false,false,null,{"$f":"IF(OR($CE$5=\"P\",$CE$5=\"SS\",$CE$5=\"S\"),INDEX(INDIRECT($CE$6),$B9,CE$8),\nIF(OR($CE$5=\"N\",$CE$5=\"AP\",$CE$5=\"AT\",$CE$5=\"SP\"),INDEX(INDIRECT($CE$7),$B9,CE$8)))","v":false},false,false,false,false,false,false,null,{"$f":"IF(OR($CM$5=\"P\",$CM$5=\"SS\",$CM$5=\"S\"),INDEX(INDIRECT($CM$6),$B9,CM$8),\nIF(OR($CM$5=\"N\",$CM$5=\"AP\",$CM$5=\"AT\",$CM$5=\"SP\"),INDEX(INDIRECT($CM$7),$B9,CM$8)))","v":false},false,false,false,false,false,false,null,{"$f":"IF(OR($CU$5=\"P\",$CU$5=\"SS\",$CU$5=\"S\"),INDEX(INDIRECT($CU$6),$B9,CU$8),\nIF(OR($CU$5=\"N\",$CU$5=\"AP\",$CU$5=\"AT\",$CU$5=\"SP\"),INDEX(INDIRECT($CU$7),$B9,CU$8)))","v":false},false,false,false,false,false,false,null,{"$f":"IF(OR($DC$5=\"P\",$DC$5=\"SS\",$DC$5=\"S\"),INDEX(INDIRECT($DC$6),$B9,DC$8),\nIF(OR($DC$5=\"N\",$DC$5=\"AP\",$DC$5=\"AT\",$DC$5=\"SP\"),INDEX(INDIRECT($DC$7),$B9,DC$8)))","v":false},false,false,false,false,false,false,null,{"$f":"IF(OR($DK$5=\"P\",$DK$5=\"SS\",$DK$5=\"S\"),INDEX(INDIRECT($DK$6),$B9,DK$8),\nIF(OR($DK$5=\"N\",$DK$5=\"AP\",$DK$5=\"AT\",$DK$5=\"SP\"),INDEX(INDIRECT($DK$7),$B9,DK$8)))","v":false},false,false,false,false,false,false,null,{"$f":"IF(OR($DS$5=\"P\",$DS$5=\"SS\",$DS$5=\"S\"),INDEX(INDIRECT($DS$6),$B9,DS$8),\nIF(OR($DS$5=\"N\",$DS$5=\"AP\",$DS$5=\"AT\",$DS$5=\"SP\"),INDEX(INDIRECT($DS$7),$B9,DS$8)))","v":false},false,false,false,false,false,false,null,{"$f":"IF(OR($EA$5=\"P\",$EA$5=\"SS\",$EA$5=\"S\"),INDEX(INDIRECT($EA$6),$B9,EA$8),\nIF(OR($EA$5=\"N\",$EA$5=\"AP\",$EA$5=\"AT\",$EA$5=\"SP\"),INDEX(INDIRECT($EA$7),$B9,EA$8)))","v":false},false,false,false,false,false,false,null,{"$f":"IF(OR($EI$5=\"P\",$EI$5=\"SS\",$EI$5=\"S\"),INDEX(INDIRECT($EI$6),$B9,EI$8),\nIF(OR($EI$5=\"N\",$EI$5=\"AP\",$EI$5=\"AT\",$EI$5=\"SP\"),INDEX(INDIRECT($EI$7),$B9,EI$8)))","v":false},false,false,false,false,false,false,null,{"$f":"IF(OR($EQ$5=\"P\",$EQ$5=\"SS\",$EQ$5=\"S\"),INDEX(INDIRECT($EQ$6),$B9,EQ$8),\nIF(OR($EQ$5=\"N\",$EQ$5=\"AP\",$EQ$5=\"AT\",$EQ$5=\"SP\"),INDEX(INDIRECT($EQ$7),$B9,EQ$8)))","v":false},false,false,false,false,false,false,null,{"$f":"IF(OR($EY$5=\"P\",$EY$5=\"SS\",$EY$5=\"S\"),INDEX(INDIRECT($EY$6),$B9,EY$8),\nIF(OR($EY$5=\"N\",$EY$5=\"AP\",$EY$5=\"AT\",$EY$5=\"SP\"),INDEX(INDIRECT($EY$7),$B9,EY$8)))","v":false},false,false,false,false,false,false]
["Spend on supply staff as a percentage of total expenditure",2,null,null,{"$f":"IF(OR($C$5=\"P\",$C$5=\"SS\",$C$5=\"S\"),INDEX(INDIRECT($C$6),$B10,E$8),\nIF(OR($C$5=\"N\",$C$5=\"AP\",$C$5=\"AT\",$C$5=\"SP\"),INDEX(INDIRECT($C$7),$B10,E$8)))","v":{"v":0.01,"d":"1.0%"}},{"v":0.015,"d":"1.5%"},{"v":0.02,"d":"2.0%"},{"v":0.03,"d":"3.0%"},{"v":0.04,"d":"4.0%"},{"$nulls":3},{"$f":"IF(OR($K$5=\"P\",$K$5=\"SS\",$K$5=\"S\"),INDEX(INDIRECT($K$6),$B10,M$8),\nIF(OR($K$5=\"N\",$K$5=\"AP\",$K$5=\"AT\",$K$5=\"SP\"),INDEX(INDIRECT($K$7),$B10,M$8)))","v":false},false,false,false,false,{"$nulls":3},{"$f":"IF(OR($S$5=\"P\",$S$5=\"SS\",$S$5=\"S\"),INDEX(INDIRECT($S$6),$B10,U$8),\nIF(OR($S$5=\"N\",$S$5=\"AP\",$S$5=\"AT\",$S$5=\"SP\"),INDEX(INDIRECT($S$7),$B10,U$8)))","v":false},false,false,false,false,{"$nulls":3},{"$f":"IF(OR($AA$5=\"P\",$AA$5=\"SS\",$AA$5=\"S\"),INDEX(INDIRECT($AA$6),$B10,AC$8),\nIF(OR($AA$5=\"N\",$AA$5=\"AP\",$AA$5=\"AT\",$AA$5=\"SP\"),INDEX(INDIRECT($AA$7),$B10,AC$8)))","v":false},false,false,false,false,{"$nulls":3},{"$f":"IF(OR($AI$5=\"P\",$AI$5=\"SS\",$AI$5=\"S\"),INDEX(INDIRECT($AI$6),$B10,AK$8),\nIF(OR($AI$5=\"N\",$AI$5=\"AP\",$AI$5=\"AT\",$AI$5=\"SP\"),INDEX(INDIRECT($AI$7),$B10,AK$8)))","v":false},false,false,false,false,{"$nulls":3},{"$f":"IF(OR($AQ$5=\"P\",$AQ$5=\"SS\",$AQ$5=\"S\"),INDEX(INDIRECT($AQ$6),$B10,AS$8),\nIF(OR($AQ$5=\"N\",$AQ$5=\"AP\",$AQ$5=\"AT\",$AQ$5=\"SP\"),INDEX(INDIRECT($AQ$7),$B10,AS$8)))","v":false},false,false,false,false,{"$nulls":3},{"$f":"IF(OR($AY$5=\"P\",$AY$5=\"SS\",$AY$5=\"S\"),INDEX(INDIRECT($AY$6),$B10,BA$8),\nIF(OR($AY$5=\"N\",$AY$5=\"AP\",$AY$5=\"AT\",$AY$5=\"SP\"),INDEX(INDIRECT($AY$7),$B10,BA$8)))","v":false},false,false,false,false,{"$nulls":3},{"$f":"IF(OR($BG$5=\"P\",$BG$5=\"SS\",$BG$5=\"S\"),INDEX(INDIRECT($BG$6),$B10,BI$8),\nIF(OR($BG$5=\"N\",$BG$5=\"AP\",$BG$5=\"AT\",$BG$5=\"SP\"),INDEX(INDIRECT($BG$7),$B10,BI$8)))","v":false},false,false,false,false,{"$nulls":3},{"$f":"IF(OR($BO$5=\"P\",$BO$5=\"SS\",$BO$5=\"S\"),INDEX(INDIRECT($BO$6),$B10,BQ$8),\nIF(OR($BO$5=\"N\",$BO$5=\"AP\",$BO$5=\"AT\",$BO$5=\"SP\"),INDEX(INDIRECT($BO$7),$B10,BQ$8)))","v":false},false,false,false,false,{"$nulls":3},{"$f":"IF(OR($BW$5=\"P\",$BW$5=\"SS\",$BW$5=\"S\"),INDEX(INDIRECT($BW$6),$B10,BY$8),\nIF(OR($BW$5=\"N\",$BW$5=\"AP\",$BW$5=\"AT\",$BW$5=\"SP\"),INDEX(INDIRECT($BW$7),$B10,BY$8)))","v":false},false,false,false,false,{"$nulls":3},{"$f":"IF(OR($CE$5=\"P\",$CE$5=\"SS\",$CE$5=\"S\"),INDEX(INDIRECT($CE$6),$B10,CG$8),\nIF(OR($CE$5=\"N\",$CE$5=\"AP\",$CE$5=\"AT\",$CE$5=\"SP\"),INDEX(INDIRECT($CE$7),$B10,CG$8)))","v":false},false,false,false,false,{"$nulls":3},{"$f":"IF(OR($CM$5=\"P\",$CM$5=\"SS\",$CM$5=\"S\"),INDEX(INDIRECT($CM$6),$B10,CO$8),\nIF(OR($CM$5=\"N\",$CM$5=\"AP\",$CM$5=\"AT\",$CM$5=\"SP\"),INDEX(INDIRECT($CM$7),$B10,CO$8)))","v":false},false,false,false,false,{"$nulls":3},{"$f":"IF(OR($CU$5=\"P\",$CU$5=\"SS\",$CU$5=\"S\"),INDEX(INDIRECT($CU$6),$B10,CW$8),\nIF(OR($CU$5=\"N\",$CU$5=\"AP\",$CU$5=\"AT\",$CU$5=\"SP\"),INDEX(INDIRECT($CU$7),$B10,CW$8)))","v":false},false,false,false,false,{"$nulls":3},{"$f":"IF(OR($DC$5=\"P\",$DC$5=\"SS\",$DC$5=\"S\"),INDEX(INDIRECT($DC$6),$B10,DE$8),\nIF(OR($DC$5=\"N\",$DC$5=\"AP\",$DC$5=\"AT\",$DC$5=\"SP\"),INDEX(INDIRECT($DC$7),$B10,DE$8)))","v":false},false,false,false,false,{"$nulls":3},{"$f":"IF(OR($DK$5=\"P\",$DK$5=\"SS\",$DK$5=\"S\"),INDEX(INDIRECT($DK$6),$B10,DM$8),\nIF(OR($DK$5=\"N\",$DK$5=\"AP\",$DK$5=\"AT\",$DK$5=\"SP\"),INDEX(INDIRECT($DK$7),$B10,DM$8)))","v":false},false,false,false,false,{"$nulls":3},{"$f":"IF(OR($DS$5=\"P\",$DS$5=\"SS\",$DS$5=\"S\"),INDEX(INDIRECT($DS$6),$B10,DU$8),\nIF(OR($DS$5=\"N\",$DS$5=\"AP\",$DS$5=\"AT\",$DS$5=\"SP\"),INDEX(INDIRECT($DS$7),$B10,DU$8)))","v":false},false,false,false,false,{"$nulls":3},{"$f":"IF(OR($EA$5=\"P\",$EA$5=\"SS\",$EA$5=\"S\"),INDEX(INDIRECT($EA$6),$B10,EC$8),\nIF(OR($EA$5=\"N\",$EA$5=\"AP\",$EA$5=\"AT\",$EA$5=\"SP\"),INDEX(INDIRECT($EA$7),$B10,EC$8)))","v":false},false,false,false,false,{"$nulls":3},{"$f":"IF(OR($EI$5=\"P\",$EI$5=\"SS\",$EI$5=\"S\"),INDEX(INDIRECT($EI$6),$B10,EK$8),\nIF(OR($EI$5=\"N\",$EI$5=\"AP\",$EI$5=\"AT\",$EI$5=\"SP\"),INDEX(INDIRECT($EI$7),$B10,EK$8)))","v":false},false,false,false,false,{"$nulls":3},{"$f":"IF(OR($EQ$5=\"P\",$EQ$5=\"SS\",$EQ$5=\"S\"),INDEX(INDIRECT($EQ$6),$B10,ES$8),\nIF(OR($EQ$5=\"N\",$EQ$5=\"AP\",$EQ$5=\"AT\",$EQ$5=\"SP\"),INDEX(INDIRECT($EQ$7),$B10,ES$8)))","v":false},false,false,false,false,{"$nulls":3},{"$f":"IF(OR($EY$5=\"P\",$EY$5=\"SS\",$EY$5=\"S\"),INDEX(INDIRECT($EY$6),$B10,FA$8),\nIF(OR($EY$5=\"N\",$EY$5=\"AP\",$EY$5=\"AT\",$EY$5=\"SP\"),INDEX(INDIRECT($EY$7),$B10,FA$8)))","v":false},false,false,false,false]
["Spend on education support staff as a percentage of total expenditure",3,null,null,{"v":0.085,"d":"8.5%"},{"v":0.09,"d":"9.0%"},{"v":0.1,"d":"10.0%"},{"v":0.115,"d":"11.5%"},{"v":0.13,"d":"13.0%"},{"$nulls":3},false,false,false,false,false,{"$nulls":3},false,false,false,false,false,{"$nulls":3},false,false,false,false,false,{"$nulls":3},false,false,false,false,false,{"$nulls":3},false,false,false,false,false,{"$nulls":3},false,false,false,false,false,{"$nulls":3},false,false,false,false,false,{"$nulls":3},false,false,false,false,false,{"$nulls":3},false,false,false,false,false,{"$nulls":3},false,false,false,false,false,{"$nulls":3},false,false,false,false,false,{"$nulls":3},false,false,false,false,false,{"$nulls":3},false,false,false,false,false,{"$nulls":3},false,false,false,false,false,{"$nulls":3},false,false,false,false,false,{"$nulls":3},false,false,false,false,false,{"$nulls":3},false,false,false,false,false,{"$nulls":3},false,false,false,false,false,{"$nulls":3},false,false,false,false,false]
["Spend on administrative and clerical staff as a percentage of total expenditure",4,{"$nulls":3},{"$f":"IF(OR($C$5=\"P\",$C$5=\"SS\",$C$5=\"S\"),INDEX(INDIRECT($C$6),$B12,F$8),\nIF(OR($C$5=\"N\",$C$5=\"AP\",$C$5=\"AT\",$C$5=\"SP\"),INDEX(INDIRECT($C$7),$B12,F$8)))","v":{"v":0.06,"d":"6.0%"}},null,{"$f":"IF(OR($C$5=\"P\",$C$5=\"SS\",$C$5=\"S\"),INDEX(INDIRECT($C$6),$B12,H$8),\nIF(OR($C$5=\"N\",$C$5=\"AP\",$C$5=\"AT\",$C$5=\"SP\"),INDEX(INDIRECT($C$7),$B12,H$8)))","v":{"v":0.08,"d":"8.0%"}},{"$f":"IF(OR($C$5=\"P\",$C$5=\"SS\",$C$5=\"S\"),INDEX(INDIRECT($C$6),$B12,I$8),\nIF(OR($C$5=\"N\",$C$5=\"AP\",$C$5=\"AT\",$C$5=\"SP\"),INDEX(INDIRECT($C$7),$B12,I$8)))","v":{"v":0.1,"d":"10.0%"}},{"$nulls":4},{"$f":"IF(OR($K$5=\"P\",$K$5=\"SS\",$K$5=\"S\"),INDEX(INDIRECT($K$6),$B12,N$8),\nIF(OR($K$5=\"N\",$K$5=\"AP\",$K$5=\"AT\",$K$5=\"SP\"),INDEX(INDIRECT($K$7),$B12,N$8)))","v":false},null,{"$f":"IF(OR($K$5=\"P\",$K$5=\"SS\",$K$5=\"S\"),INDEX(INDIRECT($K$6),$B12,P$8),\nIF(OR($K$5=\"N\",$K$5=\"AP\",$K$5=\"AT\",$K$5=\"SP\"),INDEX(INDIRECT($K$7),$B12,P$8)))","v":false},{"$f":"IF(OR($K$5=\"P\",$K$5=\"SS\",$K$5=\"S\"),INDEX(INDIRECT($K$6),$B12,Q$8),\nIF(OR($K$5=\"N\",$K$5=\"AP\",$K$5=\"AT\",$K$5=\"SP\"),INDEX(INDIRECT($K$7),$B12,Q$8)))","v":false},{"$nulls":4},{"$f":"IF(OR($S$5=\"P\",$S$5=\"SS\",$S$5=\"S\"),INDEX(INDIRECT($S$6),$B12,V$8),\nIF(OR($S$5=\"N\",$S$5=\"AP\",$S$5=\"AT\",$S$5=\"SP\"),INDEX(INDIRECT($S$7),$B12,V$8)))","v":false},null,{"$f":"IF(OR($S$5=\"P\",$S$5=\"SS\",$S$5=\"S\"),INDEX(INDIRECT($S$6),$B12,X$8),\nIF(OR($S$5=\"N\",$S$5=\"AP\",$S$5=\"AT\",$S$5=\"SP\"),INDEX(INDIRECT($S$7),$B12,X$8)))","v":false},{"$f":"IF(OR($S$5=\"P\",$S$5=\"SS\",$S$5=\"S\"),INDEX(INDIRECT($S$6),$B12,Y$8),\nIF(OR($S$5=\"N\",$S$5=\"AP\",$S$5=\"AT\",$S$5=\"SP\"),INDEX(INDIRECT($S$7),$B12,Y$8)))","v":false},{"$nulls":4},{"$f":"IF(OR($AA$5=\"P\",$AA$5=\"SS\",$AA$5=\"S\"),INDEX(INDIRECT($AA$6),$B12,AD$8),\nIF(OR($AA$5=\"N\",$AA$5=\"AP\",$AA$5=\"AT\",$AA$5=\"SP\"),INDEX(INDIRECT($AA$7),$B12,AD$8)))","v":false},null,{"$f":"IF(OR($AA$5=\"P\",$AA$5=\"SS\",$AA$5=\"S\"),INDEX(INDIRECT($AA$6),$B12,AF$8),\nIF(OR($AA$5=\"N\",$AA$5=\"AP\",$AA$5=\"AT\",$AA$5=\"SP\"),INDEX(INDIRECT($AA$7),$B12,AF$8)))","v":false},{"$f":"IF(OR($AA$5=\"P\",$AA$5=\"SS\",$AA$5=\"S\"),INDEX(INDIRECT($AA$6),$B12,AG$8),\nIF(OR($AA$5=\"N\",$AA$5=\"AP\",$AA$5=\"AT\",$AA$5=\"SP\"),INDEX(INDIRECT($AA$7),$B12,AG$8)))","v":false},{"$nulls":4},{"$f":"IF(OR($AI$5=\"P\",$AI$5=\"SS\",$AI$5=\"S\"),INDEX(INDIRECT($AI$6),$B12,AL$8),\nIF(OR($AI$5=\"N\",$AI$5=\"AP\",$AI$5=\"AT\",$AI$5=\"SP\"),INDEX(INDIRECT($AI$7),$B12,AL$8)))","v":false},null,{"$f":"IF(OR($AI$5=\"P\",$AI$5=\"SS\",$AI$5=\"S\"),INDEX(INDIRECT($AI$6),$B12,AN$8),\nIF(OR($AI$5=\"N\",$AI$5=\"AP\",$AI$5=\"AT\",$AI$5=\"SP\"),INDEX(INDIRECT($AI$7),$B12,AN$8)))","v":false},{"$f":"IF(OR($AI$5=\"P\",$AI$5=\"SS\",$AI$5=\"S\"),INDEX(INDIRECT($AI$6),$B12,AO$8),\nIF(OR($AI$5=\"N\",$AI$5=\"AP\",$AI$5=\"AT\",$AI$5=\"SP\"),INDEX(INDIRECT($AI$7),$B12,AO$8)))","v":false},{"$nulls":4},{"$f":"IF(OR($AQ$5=\"P\",$AQ$5=\"SS\",$AQ$5=\"S\"),INDEX(INDIRECT($AQ$6),$B12,AT$8),\nIF(OR($AQ$5=\"N\",$AQ$5=\"AP\",$AQ$5=\"AT\",$AQ$5=\"SP\"),INDEX(INDIRECT($AQ$7),$B12,AT$8)))","v":false},null,{"$f":"IF(OR($AQ$5=\"P\",$AQ$5=\"SS\",$AQ$5=\"S\"),INDEX(INDIRECT($AQ$6),$B12,AV$8),\nIF(OR($AQ$5=\"N\",$AQ$5=\"AP\",$AQ$5=\"AT\",$AQ$5=\"SP\"),INDEX(INDIRECT($AQ$7),$B12,AV$8)))","v":false},{"$f":"IF(OR($AQ$5=\"P\",$AQ$5=\"SS\",$AQ$5=\"S\"),INDEX(INDIRECT($AQ$6),$B12,AW$8),\nIF(OR($AQ$5=\"N\",$AQ$5=\"AP\",$AQ$5=\"AT\",$AQ$5=\"SP\"),INDEX(INDIRECT($AQ$7),$B12,AW$8)))","v":false},{"$nulls":4},{"$f":"IF(OR($AY$5=\"P\",$AY$5=\"SS\",$AY$5=\"S\"),INDEX(INDIRECT($AY$6),$B12,BB$8),\nIF(OR($AY$5=\"N\",$AY$5=\"AP\",$AY$5=\"AT\",$AY$5=\"SP\"),INDEX(INDIRECT($AY$7),$B12,BB$8)))","v":false},null,{"$f":"IF(OR($AY$5=\"P\",$AY$5=\"SS\",$AY$5=\"S\"),INDEX(INDIRECT($AY$6),$B12,BD$8),\nIF(OR($AY$5=\"N\",$AY$5=\"AP\",$AY$5=\"AT\",$AY$5=\"SP\"),INDEX(INDIRECT($AY$7),$B12,BD$8)))","v":false},{"$f":"IF(OR($AY$5=\"P\",$AY$5=\"SS\",$AY$5=\"S\"),INDEX(INDIRECT($AY$6),$B12,BE$8),\nIF(OR($AY$5=\"N\",$AY$5=\"AP\",$AY$5=\"AT\",$AY$5=\"SP\"),INDEX(INDIRECT($AY$7),$B12,BE$8)))","v":false},{"$nulls":4},{"$f":"IF(OR($BG$5=\"P\",$BG$5=\"SS\",$BG$5=\"S\"),INDEX(INDIRECT($BG$6),$B12,BJ$8),\nIF(OR($BG$5=\"N\",$BG$5=\"AP\",$BG$5=\"AT\",$BG$5=\"SP\"),INDEX(INDIRECT($BG$7),$B12,BJ$8)))","v":false},null,{"$f":"IF(OR($BG$5=\"P\",$BG$5=\"SS\",$BG$5=\"S\"),INDEX(INDIRECT($BG$6),$B12,BL$8),\nIF(OR($BG$5=\"N\",$BG$5=\"AP\",$BG$5=\"AT\",$BG$5=\"SP\"),INDEX(INDIRECT($BG$7),$B12,BL$8)))","v":false},{"$f":"IF(OR($BG$5=\"P\",$BG$5=\"SS\",$BG$5=\"S\"),INDEX(INDIRECT($BG$6),$B12,BM$8),\nIF(OR($BG$5=\"N\",$BG$5=\"AP\",$BG$5=\"AT\",$BG$5=\"SP\"),INDEX(INDIRECT($BG$7),$B12,BM$8)))","v":false},{"$nulls":4},{"$f":"IF(OR($BO$5=\"P\",$BO$5=\"SS\",$BO$5=\"S\"),INDEX(INDIRECT($BO$6),$B12,BR$8),\nIF(OR($BO$5=\"N\",$BO$5=\"AP\",$BO$5=\"AT\",$BO$5=\"SP\"),INDEX(INDIRECT($BO$7),$B12,BR$8)))","v":false},null,{"$f":"IF(OR($BO$5=\"P\",$BO$5=\"SS\",$BO$5=\"S\"),INDEX(INDIRECT($BO$6),$B12,BT$8),\nIF(OR($BO$5=\"N\",$BO$5=\"AP\",$BO$5=\"AT\",$BO$5=\"SP\"),INDEX(INDIRECT($BO$7),$B12,BT$8)))","v":false},{"$f":"IF(OR($BO$5=\"P\",$BO$5=\"SS\",$BO$5=\"S\"),INDEX(INDIRECT($BO$6),$B12,BU$8),\nIF(OR($BO$5=\"N\",$BO$5=\"AP\",$BO$5=\"AT\",$BO$5=\"SP\"),INDEX(INDIRECT($BO$7),$B12,BU$8)))","v":false},{"$nulls":4},{"$f":"IF(OR($BW$5=\"P\",$BW$5=\"SS\",$BW$5=\"S\"),INDEX(INDIRECT($BW$6),$B12,BZ$8),\nIF(OR($BW$5=\"N\",$BW$5=\"AP\",$BW$5=\"AT\",$BW$5=\"SP\"),INDEX(INDIRECT($BW$7),$B12,BZ$8)))","v":false},null,{"$f":"IF(OR($BW$5=\"P\",$BW$5=\"SS\",$BW$5=\"S\"),INDEX(INDIRECT($BW$6),$B12,CB$8),\nIF(OR($BW$5=\"N\",$BW$5=\"AP\",$BW$5=\"AT\",$BW$5=\"SP\"),INDEX(INDIRECT($BW$7),$B12,CB$8)))","v":false},{"$f":"IF(OR($BW$5=\"P\",$BW$5=\"SS\",$BW$5=\"S\"),INDEX(INDIRECT($BW$6),$B12,CC$8),\nIF(OR($BW$5=\"N\",$BW$5=\"AP\",$BW$5=\"AT\",$BW$5=\"SP\"),INDEX(INDIRECT($BW$7),$B12,CC$8)))","v":false},{"$nulls":4},{"$f":"IF(OR($CE$5=\"P\",$CE$5=\"SS\",$CE$5=\"S\"),INDEX(INDIRECT($CE$6),$B12,CH$8),\nIF(OR($CE$5=\"N\",$CE$5=\"AP\",$CE$5=\"AT\",$CE$5=\"SP\"),INDEX(INDIRECT($CE$7),$B12,CH$8)))","v":false},null,{"$f":"IF(OR($CE$5=\"P\",$CE$5=\"SS\",$CE$5=\"S\"),INDEX(INDIRECT($CE$6),$B12,CJ$8),\nIF(OR($CE$5=\"N\",$CE$5=\"AP\",$CE$5=\"AT\",$CE$5=\"SP\"),INDEX(INDIRECT($CE$7),$B12,CJ$8)))","v":false},{"$f":"IF(OR($CE$5=\"P\",$CE$5=\"SS\",$CE$5=\"S\"),INDEX(INDIRECT($CE$6),$B12,CK$8),\nIF(OR($CE$5=\"N\",$CE$5=\"AP\",$CE$5=\"AT\",$CE$5=\"SP\"),INDEX(INDIRECT($CE$7),$B12,CK$8)))","v":false},{"$nulls":4},{"$f":"IF(OR($CM$5=\"P\",$CM$5=\"SS\",$CM$5=\"S\"),INDEX(INDIRECT($CM$6),$B12,CP$8),\nIF(OR($CM$5=\"N\",$CM$5=\"AP\",$CM$5=\"AT\",$CM$5=\"SP\"),INDEX(INDIRECT($CM$7),$B12,CP$8)))","v":false},null,{"$f":"IF(OR($CM$5=\"P\",$CM$5=\"SS\",$CM$5=\"S\"),INDEX(INDIRECT($CM$6),$B12,CR$8),\nIF(OR($CM$5=\"N\",$CM$5=\"AP\",$CM$5=\"AT\",$CM$5=\"SP\"),INDEX(INDIRECT($CM$7),$B12,CR$8)))","v":false},{"$f":"IF(OR($CM$5=\"P\",$CM$5=\"SS\",$CM$5=\"S\"),INDEX(INDIRECT($CM$6),$B12,CS$8),\nIF(OR($CM$5=\"N\",$CM$5=\"AP\",$CM$5=\"AT\",$CM$5=\"SP\"),INDEX(INDIRECT($CM$7),$B12,CS$8)))","v":false},{"$nulls":4},{"$f":"IF(OR($CU$5=\"P\",$CU$5=\"SS\",$CU$5=\"S\"),INDEX(INDIRECT($CU$6),$B12,CX$8),\nIF(OR($CU$5=\"N\",$CU$5=\"AP\",$CU$5=\"AT\",$CU$5=\"SP\"),INDEX(INDIRECT($CU$7),$B12,CX$8)))","v":false},null,{"$f":"IF(OR($CU$5=\"P\",$CU$5=\"SS\",$CU$5=\"S\"),INDEX(INDIRECT($CU$6),$B12,CZ$8),\nIF(OR($CU$5=\"N\",$CU$5=\"AP\",$CU$5=\"AT\",$CU$5=\"SP\"),INDEX(INDIRECT($CU$7),$B12,CZ$8)))","v":false},{"$f":"IF(OR($CU$5=\"P\",$CU$5=\"SS\",$CU$5=\"S\"),INDEX(INDIRECT($CU$6),$B12,DA$8),\nIF(OR($CU$5=\"N\",$CU$5=\"AP\",$CU$5=\"AT\",$CU$5=\"SP\"),INDEX(INDIRECT($CU$7),$B12,DA$8)))","v":false},{"$nulls":4},{"$f":"IF(OR($DC$5=\"P\",$DC$5=\"SS\",$DC$5=\"S\"),INDEX(INDIRECT($DC$6),$B12,DF$8),\nIF(OR($DC$5=\"N\",$DC$5=\"AP\",$DC$5=\"AT\",$DC$5=\"SP\"),INDEX(INDIRECT($DC$7),$B12,DF$8)))","v":false},null,{"$f":"IF(OR($DC$5=\"P\",$DC$5=\"SS\",$DC$5=\"S\"),INDEX(INDIRECT($DC$6),$B12,DH$8),\nIF(OR($DC$5=\"N\",$DC$5=\"AP\",$DC$5=\"AT\",$DC$5=\"SP\"),INDEX(INDIRECT($DC$7),$B12,DH$8)))","v":false},{"$f":"IF(OR($DC$5=\"P\",$DC$5=\"SS\",$DC$5=\"S\"),INDEX(INDIRECT($DC$6),$B12,DI$8),\nIF(OR($DC$5=\"N\",$DC$5=\"AP\",$DC$5=\"AT\",$DC$5=\"SP\"),INDEX(INDIRECT($DC$7),$B12,DI$8)))","v":false},{"$nulls":4},{"$f":"IF(OR($DK$5=\"P\",$DK$5=\"SS\",$DK$5=\"S\"),INDEX(INDIRECT($DK$6),$B12,DN$8),\nIF(OR($DK$5=\"N\",$DK$5=\"AP\",$DK$5=\"AT\",$DK$5=\"SP\"),INDEX(INDIRECT($DK$7),$B12,DN$8)))","v":false},null,{"$f":"IF(OR($DK$5=\"P\",$DK$5=\"SS\",$DK$5=\"S\"),INDEX(INDIRECT($DK$6),$B12,DP$8),\nIF(OR($DK$5=\"N\",$DK$5=\"AP\",$DK$5=\"AT\",$DK$5=\"SP\"),INDEX(INDIRECT($DK$7),$B12,DP$8)))","v":false},{"$f":"IF(OR($DK$5=\"P\",$DK$5=\"SS\",$DK$5=\"S\"),INDEX(INDIRECT($DK$6),$B12,DQ$8),\nIF(OR($DK$5=\"N\",$DK$5=\"AP\",$DK$5=\"AT\",$DK$5=\"SP\"),INDEX(INDIRECT($DK$7),$B12,DQ$8)))","v":false},{"$nulls":4},{"$f":"IF(OR($DS$5=\"P\",$DS$5=\"SS\",$DS$5=\"S\"),INDEX(INDIRECT($DS$6),$B12,DV$8),\nIF(OR($DS$5=\"N\",$DS$5=\"AP\",$DS$5=\"AT\",$DS$5=\"SP\"),INDEX(INDIRECT($DS$7),$B12,DV$8)))","v":false},null,{"$f":"IF(OR($DS$5=\"P\",$DS$5=\"SS\",$DS$5=\"S\"),INDEX(INDIRECT($DS$6),$B12,DX$8),\nIF(OR($DS$5=\"N\",$DS$5=\"AP\",$DS$5=\"AT\",$DS$5=\"SP\"),INDEX(INDIRECT($DS$7),$B12,DX$8)))","v":false},{"$f":"IF(OR($DS$5=\"P\",$DS$5=\"SS\",$DS$5=\"S\"),INDEX(INDIRECT($DS$6),$B12,DY$8),\nIF(OR($DS$5=\"N\",$DS$5=\"AP\",$DS$5=\"AT\",$DS$5=\"SP\"),INDEX(INDIRECT($DS$7),$B12,DY$8)))","v":false},{"$nulls":4},{"$f":"IF(OR($EA$5=\"P\",$EA$5=\"SS\",$EA$5=\"S\"),INDEX(INDIRECT($EA$6),$B12,ED$8),\nIF(OR($EA$5=\"N\",$EA$5=\"AP\",$EA$5=\"AT\",$EA$5=\"SP\"),INDEX(INDIRECT($EA$7),$B12,ED$8)))","v":false},null,{"$f":"IF(OR($EA$5=\"P\",$EA$5=\"SS\",$EA$5=\"S\"),INDEX(INDIRECT($EA$6),$B12,EF$8),\nIF(OR($EA$5=\"N\",$EA$5=\"AP\",$EA$5=\"AT\",$EA$5=\"SP\"),INDEX(INDIRECT($EA$7),$B12,EF$8)))","v":false},{"$f":"IF(OR($EA$5=\"P\",$EA$5=\"SS\",$EA$5=\"S\"),INDEX(INDIRECT($EA$6),$B12,EG$8),\nIF(OR($EA$5=\"N\",$EA$5=\"AP\",$EA$5=\"AT\",$EA$5=\"SP\"),INDEX(INDIRECT($EA$7),$B12,EG$8)))","v":false},{"$nulls":4},{"$f":"IF(OR($EI$5=\"P\",$EI$5=\"SS\",$EI$5=\"S\"),INDEX(INDIRECT($EI$6),$B12,EL$8),\nIF(OR($EI$5=\"N\",$EI$5=\"AP\",$EI$5=\"AT\",$EI$5=\"SP\"),INDEX(INDIRECT($EI$7),$B12,EL$8)))","v":false},null,{"$f":"IF(OR($EI$5=\"P\",$EI$5=\"SS\",$EI$5=\"S\"),INDEX(INDIRECT($EI$6),$B12,EN$8),\nIF(OR($EI$5=\"N\",$EI$5=\"AP\",$EI$5=\"AT\",$EI$5=\"SP\"),INDEX(INDIRECT($EI$7),$B12,EN$8)))","v":false},{"$f":"IF(OR($EI$5=\"P\",$EI$5=\"SS\",$EI$5=\"S\"),INDEX(INDIRECT($EI$6),$B12,EO$8),\nIF(OR($EI$5=\"N\",$EI$5=\"AP\",$EI$5=\"AT\",$EI$5=\"SP\"),INDEX(INDIRECT($EI$7),$B12,EO$8)))","v":false},{"$nulls":4},{"$f":"IF(OR($EQ$5=\"P\",$EQ$5=\"SS\",$EQ$5=\"S\"),INDEX(INDIRECT($EQ$6),$B12,ET$8),\nIF(OR($EQ$5=\"N\",$EQ$5=\"AP\",$EQ$5=\"AT\",$EQ$5=\"SP\"),INDEX(INDIRECT($EQ$7),$B12,ET$8)))","v":false},null,{"$f":"IF(OR($EQ$5=\"P\",$EQ$5=\"SS\",$EQ$5=\"S\"),INDEX(INDIRECT($EQ$6),$B12,EV$8),\nIF(OR($EQ$5=\"N\",$EQ$5=\"AP\",$EQ$5=\"AT\",$EQ$5=\"SP\"),INDEX(INDIRECT($EQ$7),$B12,EV$8)))","v":false},{"$f":"IF(OR($EQ$5=\"P\",$EQ$5=\"SS\",$EQ$5=\"S\"),INDEX(INDIRECT($EQ$6),$B12,EW$8),\nIF(OR($EQ$5=\"N\",$EQ$5=\"AP\",$EQ$5=\"AT\",$EQ$5=\"SP\"),INDEX(INDIRECT($EQ$7),$B12,EW$8)))","v":false},{"$nulls":4},{"$f":"IF(OR($EY$5=\"P\",$EY$5=\"SS\",$EY$5=\"S\"),INDEX(INDIRECT($EY$6),$B12,FB$8),\nIF(OR($EY$5=\"N\",$EY$5=\"AP\",$EY$5=\"AT\",$EY$5=\"SP\"),INDEX(INDIRECT($EY$7),$B12,FB$8)))","v":false},null,{"$f":"IF(OR($EY$5=\"P\",$EY$5=\"SS\",$EY$5=\"S\"),INDEX(INDIRECT($EY$6),$B12,FD$8),\nIF(OR($EY$5=\"N\",$EY$5=\"AP\",$EY$5=\"AT\",$EY$5=\"SP\"),INDEX(INDIRECT($EY$7),$B12,FD$8)))","v":false},{"$f":"IF(OR($EY$5=\"P\",$EY$5=\"SS\",$EY$5=\"S\"),INDEX(INDIRECT($EY$6),$B12,FE$8),\nIF(OR($EY$5=\"N\",$EY$5=\"AP\",$EY$5=\"AT\",$EY$5=\"SP\"),INDEX(INDIRECT($EY$7),$B12,FE$8)))","v":false}]
["Spend on other staff costs as a percentage of total expenditure",5,{"$nulls":3},{"v":0.015,"d":"1.5%"},null,{"$f":"IF(OR($C$5=\"P\",$C$5=\"SS\",$C$5=\"S\"),INDEX(INDIRECT($C$6),$B13,H$8),\nIF(OR($C$5=\"N\",$C$5=\"AP\",$C$5=\"AT\",$C$5=\"SP\"),INDEX(INDIRECT($C$7),$B13,H$8)))","v":{"v":0.03,"d":"3.0%"}},{"$f":"IF(OR($C$5=\"P\",$C$5=\"SS\",$C$5=\"S\"),INDEX(INDIRECT($C$6),$B13,I$8),\nIF(OR($C$5=\"N\",$C$5=\"AP\",$C$5=\"AT\",$C$5=\"SP\"),INDEX(INDIRECT($C$7),$B13,I$8)))","v":{"v":0.05,"d":"5.0%"}},{"$nulls":4},false,null,{"$f":"IF(OR($K$5=\"P\",$K$5=\"SS\",$K$5=\"S\"),INDEX(INDIRECT($K$6),$B13,P$8),\nIF(OR($K$5=\"N\",$K$5=\"AP\",$K$5=\"AT\",$K$5=\"SP\"),INDEX(INDIRECT($K$7),$B13,P$8)))","v":false},{"$f":"IF(OR($K$5=\"P\",$K$5=\"SS\",$K$5=\"S\"),INDEX(INDIRECT($K$6),$B13,Q$8),\nIF(OR($K$5=\"N\",$K$5=\"AP\",$K$5=\"AT\",$K$5=\"SP\"),INDEX(INDIRECT($K$7),$B13,Q$8)))","v":false},{"$nulls":4},false,null,{"$f":"IF(OR($S$5=\"P\",$S$5=\"SS\",$S$5=\"S\"),INDEX(INDIRECT($S$6),$B13,X$8),\nIF(OR($S$5=\"N\",$S$5=\"AP\",$S$5=\"AT\",$S$5=\"SP\"),INDEX(INDIRECT($S$7),$B13,X$8)))","v":false},{"$f":"IF(OR($S$5=\"P\",$S$5=\"SS\",$S$5=\"S\"),INDEX(INDIRECT($S$6),$B13,Y$8),\nIF(OR($S$5=\"N\",$S$5=\"AP\",$S$5=\"AT\",$S$5=\"SP\"),INDEX(INDIRECT($S$7),$B13,Y$8)))","v":false},{"$nulls":4},false,null,{"$f":"IF(OR($AA$5=\"P\",$AA$5=\"SS\",$AA$5=\"S\"),INDEX(INDIRECT($AA$6),$B13,AF$8),\nIF(OR($AA$5=\"N\",$AA$5=\"AP\",$AA$5=\"AT\",$AA$5=\"SP\"),INDEX(INDIRECT($AA$7),$B13,AF$8)))","v":false},{"$f":"IF(OR($AA$5=\"P\",$AA$5=\"SS\",$AA$5=\"S\"),INDEX(INDIRECT($AA$6),$B13,AG$8),\nIF(OR($AA$5=\"N\",$AA$5=\"AP\",$AA$5=\"AT\",$AA$5=\"SP\"),INDEX(INDIRECT($AA$7),$B13,AG$8)))","v":false},{"$nulls":4},false,null,{"$f":"IF(OR($AI$5=\"P\",$AI$5=\"SS\",$AI$5=\"S\"),INDEX(INDIRECT($AI$6),$B13,AN$8),\nIF(OR($AI$5=\"N\",$AI$5=\"AP\",$AI$5=\"AT\",$AI$5=\"SP\"),INDEX(INDIRECT($AI$7),$B13,AN$8)))","v":false},{"$f":"IF(OR($AI$5=\"P\",$AI$5=\"SS\",$AI$5=\"S\"),INDEX(INDIRECT($AI$6),$B13,AO$8),\nIF(OR($AI$5=\"N\",$AI$5=\"AP\",$AI$5=\"AT\",$AI$5=\"SP\"),INDEX(INDIRECT($AI$7),$B13,AO$8)))","v":false},{"$nulls":4},false,null,{"$f":"IF(OR($AQ$5=\"P\",$AQ$5=\"SS\",$AQ$5=\"S\"),INDEX(INDIRECT($AQ$6),$B13,AV$8),\nIF(OR($AQ$5=\"N\",$AQ$5=\"AP\",$AQ$5=\"AT\",$AQ$5=\"SP\"),INDEX(INDIRECT($AQ$7),$B13,AV$8)))","v":false},{"$f":"IF(OR($AQ$5=\"P\",$AQ$5=\"SS\",$AQ$5=\"S\"),INDEX(INDIRECT($AQ$6),$B13,AW$8),\nIF(OR($AQ$5=\"N\",$AQ$5=\"AP\",$AQ$5=\"AT\",$AQ$5=\"SP\"),INDEX(INDIRECT($AQ$7),$B13,AW$8)))","v":false},{"$nulls":4},false,null,{"$f":"IF(OR($AY$5=\"P\",$AY$5=\"SS\",$AY$5=\"S\"),INDEX(INDIRECT($AY$6),$B13,BD$8),\nIF(OR($AY$5=\"N\",$AY$5=\"AP\",$AY$5=\"AT\",$AY$5=\"SP\"),INDEX(INDIRECT($AY$7),$B13,BD$8)))","v":false},{"$f":"IF(OR($AY$5=\"P\",$AY$5=\"SS\",$AY$5=\"S\"),INDEX(INDIRECT($AY$6),$B13,BE$8),\nIF(OR($AY$5=\"N\",$AY$5=\"AP\",$AY$5=\"AT\",$AY$5=\"SP\"),INDEX(INDIRECT($AY$7),$B13,BE$8)))","v":false},{"$nulls":4},false,null,{"$f":"IF(OR($BG$5=\"P\",$BG$5=\"SS\",$BG$5=\"S\"),INDEX(INDIRECT($BG$6),$B13,BL$8),\nIF(OR($BG$5=\"N\",$BG$5=\"AP\",$BG$5=\"AT\",$BG$5=\"SP\"),INDEX(INDIRECT($BG$7),$B13,BL$8)))","v":false},{"$f":"IF(OR($BG$5=\"P\",$BG$5=\"SS\",$BG$5=\"S\"),INDEX(INDIRECT($BG$6),$B13,BM$8),\nIF(OR($BG$5=\"N\",$BG$5=\"AP\",$BG$5=\"AT\",$BG$5=\"SP\"),INDEX(INDIRECT($BG$7),$B13,BM$8)))","v":false},{"$nulls":4},false,null,{"$f":"IF(OR($BO$5=\"P\",$BO$5=\"SS\",$BO$5=\"S\"),INDEX(INDIRECT($BO$6),$B13,BT$8),\nIF(OR($BO$5=\"N\",$BO$5=\"AP\",$BO$5=\"AT\",$BO$5=\"SP\"),INDEX(INDIRECT($BO$7),$B13,BT$8)))","v":false},{"$f":"IF(OR($BO$5=\"P\",$BO$5=\"SS\",$BO$5=\"S\"),INDEX(INDIRECT($BO$6),$B13,BU$8),\nIF(OR($BO$5=\"N\",$BO$5=\"AP\",$BO$5=\"AT\",$BO$5=\"SP\"),INDEX(INDIRECT($BO$7),$B13,BU$8)))","v":false},{"$nulls":4},false,null,{"$f":"IF(OR($BW$5=\"P\",$BW$5=\"SS\",$BW$5=\"S\"),INDEX(INDIRECT($BW$6),$B13,CB$8),\nIF(OR($BW$5=\"N\",$BW$5=\"AP\",$BW$5=\"AT\",$BW$5=\"SP\"),INDEX(INDIRECT($BW$7),$B13,CB$8)))","v":false},{"$f":"IF(OR($BW$5=\"P\",$BW$5=\"SS\",$BW$5=\"S\"),INDEX(INDIRECT($BW$6),$B13,CC$8),\nIF(OR($BW$5=\"N\",$BW$5=\"AP\",$BW$5=\"AT\",$BW$5=\"SP\"),INDEX(INDIRECT($BW$7),$B13,CC$8)))","v":false},{"$nulls":4},false,null,{"$f":"IF(OR($CE$5=\"P\",$CE$5=\"SS\",$CE$5=\"S\"),INDEX(INDIRECT($CE$6),$B13,CJ$8),\nIF(OR($CE$5=\"N\",$CE$5=\"AP\",$CE$5=\"AT\",$CE$5=\"SP\"),INDEX(INDIRECT($CE$7),$B13,CJ$8)))","v":false},{"$f":"IF(OR($CE$5=\"P\",$CE$5=\"SS\",$CE$5=\"S\"),INDEX(INDIRECT($CE$6),$B13,CK$8),\nIF(OR($CE$5=\"N\",$CE$5=\"AP\",$CE$5=\"AT\",$CE$5=\"SP\"),INDEX(INDIRECT($CE$7),$B13,CK$8)))","v":false},{"$nulls":4},false,null,{"$f":"IF(OR($CM$5=\"P\",$CM$5=\"SS\",$CM$5=\"S\"),INDEX(INDIRECT($CM$6),$B13,CR$8),\nIF(OR($CM$5=\"N\",$CM$5=\"AP\",$CM$5=\"AT\",$CM$5=\"SP\"),INDEX(INDIRECT($CM$7),$B13,CR$8)))","v":false},{"$f":"IF(OR($CM$5=\"P\",$CM$5=\"SS\",$CM$5=\"S\"),INDEX(INDIRECT($CM$6),$B13,CS$8),\nIF(OR($CM$5=\"N\",$CM$5=\"AP\",$CM$5=\"AT\",$CM$5=\"SP\"),INDEX(INDIRECT($CM$7),$B13,CS$8)))","v":false},{"$nulls":4},false,null,{"$f":"IF(OR($CU$5=\"P\",$CU$5=\"SS\",$CU$5=\"S\"),INDEX(INDIRECT($CU$6),$B13,CZ$8),\nIF(OR($CU$5=\"N\",$CU$5=\"AP\",$CU$5=\"AT\",$CU$5=\"SP\"),INDEX(INDIRECT($CU$7),$B13,CZ$8)))","v":false},{"$f":"IF(OR($CU$5=\"P\",$CU$5=\"SS\",$CU$5=\"S\"),INDEX(INDIRECT($CU$6),$B13,DA$8),\nIF(OR($CU$5=\"N\",$CU$5=\"AP\",$CU$5=\"AT\",$CU$5=\"SP\"),INDEX(INDIRECT($CU$7),$B13,DA$8)))","v":false},{"$nulls":4},false,null,{"$f":"IF(OR($DC$5=\"P\",$DC$5=\"SS\",$DC$5=\"S\"),INDEX(INDIRECT($DC$6),$B13,DH$8),\nIF(OR($DC$5=\"N\",$DC$5=\"AP\",$DC$5=\"AT\",$DC$5=\"SP\"),INDEX(INDIRECT($DC$7),$B13,DH$8)))","v":false},{"$f":"IF(OR($DC$5=\"P\",$DC$5=\"SS\",$DC$5=\"S\"),INDEX(INDIRECT($DC$6),$B13,DI$8),\nIF(OR($DC$5=\"N\",$DC$5=\"AP\",$DC$5=\"AT\",$DC$5=\"SP\"),INDEX(INDIRECT($DC$7),$B13,DI$8)))","v":false},{"$nulls":4},false,null,{"$f":"IF(OR($DK$5=\"P\",$DK$5=\"SS\",$DK$5=\"S\"),INDEX(INDIRECT($DK$6),$B13,DP$8),\nIF(OR($DK$5=\"N\",$DK$5=\"AP\",$DK$5=\"AT\",$DK$5=\"SP\"),INDEX(INDIRECT($DK$7),$B13,DP$8)))","v":false},{"$f":"IF(OR($DK$5=\"P\",$DK$5=\"SS\",$DK$5=\"S\"),INDEX(INDIRECT($DK$6),$B13,DQ$8),\nIF(OR($DK$5=\"N\",$DK$5=\"AP\",$DK$5=\"AT\",$DK$5=\"SP\"),INDEX(INDIRECT($DK$7),$B13,DQ$8)))","v":false},{"$nulls":4},false,null,{"$f":"IF(OR($DS$5=\"P\",$DS$5=\"SS\",$DS$5=\"S\"),INDEX(INDIRECT($DS$6),$B13,DX$8),\nIF(OR($DS$5=\"N\",$DS$5=\"AP\",$DS$5=\"AT\",$DS$5=\"SP\"),INDEX(INDIRECT($DS$7),$B13,DX$8)))","v":false},{"$f":"IF(OR($DS$5=\"P\",$DS$5=\"SS\",$DS$5=\"S\"),INDEX(INDIRECT($DS$6),$B13,DY$8),\nIF(OR($DS$5=\"N\",$DS$5=\"AP\",$DS$5=\"AT\",$DS$5=\"SP\"),INDEX(INDIRECT($DS$7),$B13,DY$8)))","v":false},{"$nulls":4},false,null,{"$f":"IF(OR($EA$5=\"P\",$EA$5=\"SS\",$EA$5=\"S\"),INDEX(INDIRECT($EA$6),$B13,EF$8),\nIF(OR($EA$5=\"N\",$EA$5=\"AP\",$EA$5=\"AT\",$EA$5=\"SP\"),INDEX(INDIRECT($EA$7),$B13,EF$8)))","v":false},{"$f":"IF(OR($EA$5=\"P\",$EA$5=\"SS\",$EA$5=\"S\"),INDEX(INDIRECT($EA$6),$B13,EG$8),\nIF(OR($EA$5=\"N\",$EA$5=\"AP\",$EA$5=\"AT\",$EA$5=\"SP\"),INDEX(INDIRECT($EA$7),$B13,EG$8)))","v":false},{"$nulls":4},false,null,{"$f":"IF(OR($EI$5=\"P\",$EI$5=\"SS\",$EI$5=\"S\"),INDEX(INDIRECT($EI$6),$B13,EN$8),\nIF(OR($EI$5=\"N\",$EI$5=\"AP\",$EI$5=\"AT\",$EI$5=\"SP\"),INDEX(INDIRECT($EI$7),$B13,EN$8)))","v":false},{"$f":"IF(OR($EI$5=\"P\",$EI$5=\"SS\",$EI$5=\"S\"),INDEX(INDIRECT($EI$6),$B13,EO$8),\nIF(OR($EI$5=\"N\",$EI$5=\"AP\",$EI$5=\"AT\",$EI$5=\"SP\"),INDEX(INDIRECT($EI$7),$B13,EO$8)))","v":false},{"$nulls":4},false,null,{"$f":"IF(OR($EQ$5=\"P\",$EQ$5=\"SS\",$EQ$5=\"S\"),INDEX(INDIRECT($EQ$6),$B13,EV$8),\nIF(OR($EQ$5=\"N\",$EQ$5=\"AP\",$EQ$5=\"AT\",$EQ$5=\"SP\"),INDEX(INDIRECT($EQ$7),$B13,EV$8)))","v":false},{"$f":"IF(OR($EQ$5=\"P\",$EQ$5=\"SS\",$EQ$5=\"S\"),INDEX(INDIRECT($EQ$6),$B13,EW$8),\nIF(OR($EQ$5=\"N\",$EQ$5=\"AP\",$EQ$5=\"AT\",$EQ$5=\"SP\"),INDEX(INDIRECT($EQ$7),$B13,EW$8)))","v":false},{"$nulls":4},false,null,{"$f":"IF(OR($EY$5=\"P\",$EY$5=\"SS\",$EY$5=\"S\"),INDEX(INDIRECT($EY$6),$B13,FD$8),\nIF(OR($EY$5=\"N\",$EY$5=\"AP\",$EY$5=\"AT\",$EY$5=\"SP\"),INDEX(INDIRECT($EY$7),$B13,FD$8)))","v":false},{"$f":"IF(OR($EY$5=\"P\",$EY$5=\"SS\",$EY$5=\"S\"),INDEX(INDIRECT($EY$6),$B13,FE$8),\nIF(OR($EY$5=\"N\",$EY$5=\"AP\",$EY$5=\"AT\",$EY$5=\"SP\"),INDEX(INDIRECT($EY$7),$B13,FE$8)))","v":false}]
["Spend on premises (including staff costs) as a percentage of total expenditure",6,{"$nulls":3},{"v":0.05,"d":"5.0%"},null,{"$f":"IF(OR($C$5=\"P\",$C$5=\"SS\",$C$5=\"S\"),INDEX(INDIRECT($C$6),$B14,H$8),\nIF(OR($C$5=\"N\",$C$5=\"AP\",$C$5=\"AT\",$C$5=\"SP\"),INDEX(INDIRECT($C$7),$B14,H$8)))","v":{"v":0.065,"d":"6.5%"}},{"v":0.085,"d":"8.5%"},{"$nulls":4},false,null,{"$f":"IF(OR($K$5=\"P\",$K$5=\"SS\",$K$5=\"S\"),INDEX(INDIRECT($K$6),$B14,P$8),\nIF(OR($K$5=\"N\",$K$5=\"AP\",$K$5=\"AT\",$K$5=\"SP\"),INDEX(INDIRECT($K$7),$B14,P$8)))","v":false},false,{"$nulls":4},false,null,{"$f":"IF(OR($S$5=\"P\",$S$5=\"SS\",$S$5=\"S\"),INDEX(INDIRECT($S$6),$B14,X$8),\nIF(OR($S$5=\"N\",$S$5=\"AP\",$S$5=\"AT\",$S$5=\"SP\"),INDEX(INDIRECT($S$7),$B14,X$8)))","v":false},false,{"$nulls":4},false,null,{"$f":"IF(OR($AA$5=\"P\",$AA$5=\"SS\",$AA$5=\"S\"),INDEX(INDIRECT($AA$6),$B14,AF$8),\nIF(OR($AA$5=\"N\",$AA$5=\"AP\",$AA$5=\"AT\",$AA$5=\"SP\"),INDEX(INDIRECT($AA$7),$B14,AF$8)))","v":false},false,{"$nulls":4},false,null,{"$f":"IF(OR($AI$5=\"P\",$AI$5=\"SS\",$AI$5=\"S\"),INDEX(INDIRECT($AI$6),$B14,AN$8),\nIF(OR($AI$5=\"N\",$AI$5=\"AP\",$AI$5=\"AT\",$AI$5=\"SP\"),INDEX(INDIRECT($AI$7),$B14,AN$8)))","v":false},false,{"$nulls":4},false,null,{"$f":"IF(OR($AQ$5=\"P\",$AQ$5=\"SS\",$AQ$5=\"S\"),INDEX(INDIRECT($AQ$6),$B14,AV$8),\nIF(OR($AQ$5=\"N\",$AQ$5=\"AP\",$AQ$5=\"AT\",$AQ$5=\"SP\"),INDEX(INDIRECT($AQ$7),$B14,AV$8)))","v":false},false,{"$nulls":4},false,null,{"$f":"IF(OR($AY$5=\"P\",$AY$5=\"SS\",$AY$5=\"S\"),INDEX(INDIRECT($AY$6),$B14,BD$8),\nIF(OR($AY$5=\"N\",$AY$5=\"AP\",$AY$5=\"AT\",$AY$5=\"SP\"),INDEX(INDIRECT($AY$7),$B14,BD$8)))","v":false},false,{"$nulls":4},false,null,{"$f":"IF(OR($BG$5=\"P\",$BG$5=\"SS\",$BG$5=\"S\"),INDEX(INDIRECT($BG$6),$B14,BL$8),\nIF(OR($BG$5=\"N\",$BG$5=\"AP\",$BG$5=\"AT\",$BG$5=\"SP\"),INDEX(INDIRECT($BG$7),$B14,BL$8)))","v":false},false,{"$nulls":4},false,null,{"$f":"IF(OR($BO$5=\"P\",$BO$5=\"SS\",$BO$5=\"S\"),INDEX(INDIRECT($BO$6),$B14,BT$8),\nIF(OR($BO$5=\"N\",$BO$5=\"AP\",$BO$5=\"AT\",$BO$5=\"SP\"),INDEX(INDIRECT($BO$7),$B14,BT$8)))","v":false},false,{"$nulls":4},false,null,{"$f":"IF(OR($BW$5=\"P\",$BW$5=\"SS\",$BW$5=\"S\"),INDEX(INDIRECT($BW$6),$B14,CB$8),\nIF(OR($BW$5=\"N\",$BW$5=\"AP\",$BW$5=\"AT\",$BW$5=\"SP\"),INDEX(INDIRECT($BW$7),$B14,CB$8)))","v":false},false,{"$nulls":4},false,null,{"$f":"IF(OR($CE$5=\"P\",$CE$5=\"SS\",$CE$5=\"S\"),INDEX(INDIRECT($CE$6),$B14,CJ$8),\nIF(OR($CE$5=\"N\",$CE$5=\"AP\",$CE$5=\"AT\",$CE$5=\"SP\"),INDEX(INDIRECT($CE$7),$B14,CJ$8)))","v":false},false,{"$nulls":4},false,null,{"$f":"IF(OR($CM$5=\"P\",$CM$5=\"SS\",$CM$5=\"S\"),INDEX(INDIRECT($CM$6),$B14,CR$8),\nIF(OR($CM$5=\"N\",$CM$5=\"AP\",$CM$5=\"AT\",$CM$5=\"SP\"),INDEX(INDIRECT($CM$7),$B14,CR$8)))","v":false},false,{"$nulls":4},false,null,{"$f":"IF(OR($CU$5=\"P\",$CU$5=\"SS\",$CU$5=\"S\"),INDEX(INDIRECT($CU$6),$B14,CZ$8),\nIF(OR($CU$5=\"N\",$CU$5=\"AP\",$CU$5=\"AT\",$CU$5=\"SP\"),INDEX(INDIRECT($CU$7),$B14,CZ$8)))","v":false},false,{"$nulls":4},false,null,{"$f":"IF(OR($DC$5=\"P\",$DC$5=\"SS\",$DC$5=\"S\"),INDEX(INDIRECT($DC$6),$B14,DH$8),\nIF(OR($DC$5=\"N\",$DC$5=\"AP\",$DC$5=\"AT\",$DC$5=\"SP\"),INDEX(INDIRECT($DC$7),$B14,DH$8)))","v":false},false,{"$nulls":4},false,null,{"$f":"IF(OR($DK$5=\"P\",$DK$5=\"SS\",$DK$5=\"S\"),INDEX(INDIRECT($DK$6),$B14,DP$8),\nIF(OR($DK$5=\"N\",$DK$5=\"AP\",$DK$5=\"AT\",$DK$5=\"SP\"),INDEX(INDIRECT($DK$7),$B14,DP$8)))","v":false},false,{"$nulls":4},false,null,{"$f":"IF(OR($DS$5=\"P\",$DS$5=\"SS\",$DS$5=\"S\"),INDEX(INDIRECT($DS$6),$B14,DX$8),\nIF(OR($DS$5=\"N\",$DS$5=\"AP\",$DS$5=\"AT\",$DS$5=\"SP\"),INDEX(INDIRECT($DS$7),$B14,DX$8)))","v":false},false,{"$nulls":4},false,null,{"$f":"IF(OR($EA$5=\"P\",$EA$5=\"SS\",$EA$5=\"S\"),INDEX(INDIRECT($EA$6),$B14,EF$8),\nIF(OR($EA$5=\"N\",$EA$5=\"AP\",$EA$5=\"AT\",$EA$5=\"SP\"),INDEX(INDIRECT($EA$7),$B14,EF$8)))","v":false},false,{"$nulls":4},false,null,{"$f":"IF(OR($EI$5=\"P\",$EI$5=\"SS\",$EI$5=\"S\"),INDEX(INDIRECT($EI$6),$B14,EN$8),\nIF(OR($EI$5=\"N\",$EI$5=\"AP\",$EI$5=\"AT\",$EI$5=\"SP\"),INDEX(INDIRECT($EI$7),$B14,EN$8)))","v":false},false,{"$nulls":4},false,null,{"$f":"IF(OR($EQ$5=\"P\",$EQ$5=\"SS\",$EQ$5=\"S\"),INDEX(INDIRECT($EQ$6),$B14,EV$8),\nIF(OR($EQ$5=\"N\",$EQ$5=\"AP\",$EQ$5=\"AT\",$EQ$5=\"SP\"),INDEX(INDIRECT($EQ$7),$B14,EV$8)))","v":false},false,{"$nulls":4},false,null,{"$f":"IF(OR($EY$5=\"P\",$EY$5=\"SS\",$EY$5=\"S\"),INDEX(INDIRECT($EY$6),$B14,FD$8),\nIF(OR($EY$5=\"N\",$EY$5=\"AP\",$EY$5=\"AT\",$EY$5=\"SP\"),INDEX(INDIRECT($EY$7),$B14,FD$8)))","v":false},false]
["Spend on teaching resources as a percentage of total expenditure",7,{"$f":"IF(OR($C$5=\"P\",$C$5=\"SS\",$C$5=\"S\"),INDEX(INDIRECT($C$6),$B15,C$8),\nIF(OR($C$5=\"N\",$C$5=\"AP\",$C$5=\"AT\",$C$5=\"SP\"),INDEX(INDIRECT($C$7),$B15,C$8)))","v":{"v":0.045,"d":"4.5%"}},{"$f":"IF(OR($C$5=\"P\",$C$5=\"SS\",$C$5=\"S\"),INDEX(INDIRECT($C$6),$B15,D$8),\nIF(OR($C$5=\"N\",$C$5=\"AP\",$C$5=\"AT\",$C$5=\"SP\"),INDEX(INDIRECT($C$7),$B15,D$8)))","v":{"v":0.055,"d":"5.5%"}},{"$f":"IF(OR($C$5=\"P\",$C$5=\"SS\",$C$5=\"S\"),INDEX(INDIRECT($C$6),$B15,E$8),\nIF(OR($C$5=\"N\",$C$5=\"AP\",$C$5=\"AT\",$C$5=\"SP\"),INDEX(INDIRECT($C$7),$B15,E$8)))","v":{"v":0.065,"d":"6.5%"}},{"$f":"IF(OR($C$5=\"P\",$C$5=\"SS\",$C$5=\"S\"),INDEX(INDIRECT($C$6),$B15,F$8),\nIF(OR($C$5=\"N\",$C$5=\"AP\",$C$5=\"AT\",$C$5=\"SP\"),INDEX(INDIRECT($C$7),$B15,F$8)))","v":{"v":0.07,"d":"7.0%"}},{"$f":"IF(OR($C$5=\"P\",$C$5=\"SS\",$C$5=\"S\"),INDEX(INDIRECT($C$6),$B15,G$8),\nIF(OR($C$5=\"N\",$C$5=\"AP\",$C$5=\"AT\",$C$5=\"SP\"),INDEX(INDIRECT($C$7),$B15,G$8)))","v":{"v":0.075,"d":"7.5%"}},{"$nulls":3},{"$f":"IF(OR($K$5=\"P\",$K$5=\"SS\",$K$5=\"S\"),INDEX(INDIRECT($K$6),$B15,K$8),\nIF(OR($K$5=\"N\",$K$5=\"AP\",$K$5=\"AT\",$K$5=\"SP\"),INDEX(INDIRECT($K$7),$B15,K$8)))","v":false},{"$f":"IF(OR($K$5=\"P\",$K$5=\"SS\",$K$5=\"S\"),INDEX(INDIRECT($K$6),$B15,L$8),\nIF(OR($K$5=\"N\",$K$5=\"AP\",$K$5=\"AT\",$K$5=\"SP\"),INDEX(INDIRECT($K$7),$B15,L$8)))","v":false},{"$f":"IF(OR($K$5=\"P\",$K$5=\"SS\",$K$5=\"S\"),INDEX(INDIRECT($K$6),$B15,M$8),\nIF(OR($K$5=\"N\",$K$5=\"AP\",$K$5=\"AT\",$K$5=\"SP\"),INDEX(INDIRECT($K$7),$B15,M$8)))","v":false},{"$f":"IF(OR($K$5=\"P\",$K$5=\"SS\",$K$5=\"S\"),INDEX(INDIRECT($K$6),$B15,N$8),\nIF(OR($K$5=\"N\",$K$5=\"AP\",$K$5=\"AT\",$K$5=\"SP\"),INDEX(INDIRECT($K$7),$B15,N$8)))","v":false},{"$f":"IF(OR($K$5=\"P\",$K$5=\"SS\",$K$5=\"S\"),INDEX(INDIRECT($K$6),$B15,O$8),\nIF(OR($K$5=\"N\",$K$5=\"AP\",$K$5=\"AT\",$K$5=\"SP\"),INDEX(INDIRECT($K$7),$B15,O$8)))","v":false},{"$nulls":3},{"$f":"IF(OR($S$5=\"P\",$S$5=\"SS\",$S$5=\"S\"),INDEX(INDIRECT($S$6),$B15,S$8),\nIF(OR($S$5=\"N\",$S$5=\"AP\",$S$5=\"AT\",$S$5=\"SP\"),INDEX(INDIRECT($S$7),$B15,S$8)))","v":false},{"$f":"IF(OR($S$5=\"P\",$S$5=\"SS\",$S$5=\"S\"),INDEX(INDIRECT($S$6),$B15,T$8),\nIF(OR($S$5=\"N\",$S$5=\"AP\",$S$5=\"AT\",$S$5=\"SP\"),INDEX(INDIRECT($S$7),$B15,T$8)))","v":false},{"$f":"IF(OR($S$5=\"P\",$S$5=\"SS\",$S$5=\"S\"),INDEX(INDIRECT($S$6),$B15,U$8),\nIF(OR($S$5=\"N\",$S$5=\"AP\",$S$5=\"AT\",$S$5=\"SP\"),INDEX(INDIRECT($S$7),$B15,U$8)))","v":false},{"$f":"IF(OR($S$5=\"P\",$S$5=\"SS\",$S$5=\"S\"),INDEX(INDIRECT($S$6),$B15,V$8),\nIF(OR($S$5=\"N\",$S$5=\"AP\",$S$5=\"AT\",$S$5=\"SP\"),INDEX(INDIRECT($S$7),$B15,V$8)))","v":false},{"$f":"IF(OR($S$5=\"P\",$S$5=\"SS\",$S$5=\"S\"),INDEX(INDIRECT($S$6),$B15,W$8),\nIF(OR($S$5=\"N\",$S$5=\"AP\",$S$5=\"AT\",$S$5=\"SP\"),INDEX(INDIRECT($S$7),$B15,W$8)))","v":false},{"$nulls":3},{"$f":"IF(OR($AA$5=\"P\",$AA$5=\"SS\",$AA$5=\"S\"),INDEX(INDIRECT($AA$6),$B15,AA$8),\nIF(OR($AA$5=\"N\",$AA$5=\"AP\",$AA$5=\"AT\",$AA$5=\"SP\"),INDEX(INDIRECT($AA$7),$B15,AA$8)))","v":false},{"$f":"IF(OR($AA$5=\"P\",$AA$5=\"SS\",$AA$5=\"S\"),INDEX(INDIRECT($AA$6),$B15,AB$8),\nIF(OR($AA$5=\"N\",$AA$5=\"AP\",$AA$5=\"AT\",$AA$5=\"SP\"),INDEX(INDIRECT($AA$7),$B15,AB$8)))","v":false},{"$f":"IF(OR($AA$5=\"P\",$AA$5=\"SS\",$AA$5=\"S\"),INDEX(INDIRECT($AA$6),$B15,AC$8),\nIF(OR($AA$5=\"N\",$AA$5=\"AP\",$AA$5=\"AT\",$AA$5=\"SP\"),INDEX(INDIRECT($AA$7),$B15,AC$8)))","v":false},{"$f":"IF(OR($AA$5=\"P\",$AA$5=\"SS\",$AA$5=\"S\"),INDEX(INDIRECT($AA$6),$B15,AD$8),\nIF(OR($AA$5=\"N\",$AA$5=\"AP\",$AA$5=\"AT\",$AA$5=\"SP\"),INDEX(INDIRECT($AA$7),$B15,AD$8)))","v":false},{"$f":"IF(OR($AA$5=\"P\",$AA$5=\"SS\",$AA$5=\"S\"),INDEX(INDIRECT($AA$6),$B15,AE$8),\nIF(OR($AA$5=\"N\",$AA$5=\"AP\",$AA$5=\"AT\",$AA$5=\"SP\"),INDEX(INDIRECT($AA$7),$B15,AE$8)))","v":false},{"$nulls":3},{"$f":"IF(OR($AI$5=\"P\",$AI$5=\"SS\",$AI$5=\"S\"),INDEX(INDIRECT($AI$6),$B15,AI$8),\nIF(OR($AI$5=\"N\",$AI$5=\"AP\",$AI$5=\"AT\",$AI$5=\"SP\"),INDEX(INDIRECT($AI$7),$B15,AI$8)))","v":false},{"$f":"IF(OR($AI$5=\"P\",$AI$5=\"SS\",$AI$5=\"S\"),INDEX(INDIRECT($AI$6),$B15,AJ$8),\nIF(OR($AI$5=\"N\",$AI$5=\"AP\",$AI$5=\"AT\",$AI$5=\"SP\"),INDEX(INDIRECT($AI$7),$B15,AJ$8)))","v":false},{"$f":"IF(OR($AI$5=\"P\",$AI$5=\"SS\",$AI$5=\"S\"),INDEX(INDIRECT($AI$6),$B15,AK$8),\nIF(OR($AI$5=\"N\",$AI$5=\"AP\",$AI$5=\"AT\",$AI$5=\"SP\"),INDEX(INDIRECT($AI$7),$B15,AK$8)))","v":false},{"$f":"IF(OR($AI$5=\"P\",$AI$5=\"SS\",$AI$5=\"S\"),INDEX(INDIRECT($AI$6),$B15,AL$8),\nIF(OR($AI$5=\"N\",$AI$5=\"AP\",$AI$5=\"AT\",$AI$5=\"SP\"),INDEX(INDIRECT($AI$7),$B15,AL$8)))","v":false},{"$f":"IF(OR($AI$5=\"P\",$AI$5=\"SS\",$AI$5=\"S\"),INDEX(INDIRECT($AI$6),$B15,AM$8),\nIF(OR($AI$5=\"N\",$AI$5=\"AP\",$AI$5=\"AT\",$AI$5=\"SP\"),INDEX(INDIRECT($AI$7),$B15,AM$8)))","v":false},{"$nulls":3},{"$f":"IF(OR($AQ$5=\"P\",$AQ$5=\"SS\",$AQ$5=\"S\"),INDEX(INDIRECT($AQ$6),$B15,AQ$8),\nIF(OR($AQ$5=\"N\",$AQ$5=\"AP\",$AQ$5=\"AT\",$AQ$5=\"SP\"),INDEX(INDIRECT($AQ$7),$B15,AQ$8)))","v":false},{"$f":"IF(OR($AQ$5=\"P\",$AQ$5=\"SS\",$AQ$5=\"S\"),INDEX(INDIRECT($AQ$6),$B15,AR$8),\nIF(OR($AQ$5=\"N\",$AQ$5=\"AP\",$AQ$5=\"AT\",$AQ$5=\"SP\"),INDEX(INDIRECT($AQ$7),$B15,AR$8)))","v":false},{"$f":"IF(OR($AQ$5=\"P\",$AQ$5=\"SS\",$AQ$5=\"S\"),INDEX(INDIRECT($AQ$6),$B15,AS$8),\nIF(OR($AQ$5=\"N\",$AQ$5=\"AP\",$AQ$5=\"AT\",$AQ$5=\"SP\"),INDEX(INDIRECT($AQ$7),$B15,AS$8)))","v":false},{"$f":"IF(OR($AQ$5=\"P\",$AQ$5=\"SS\",$AQ$5=\"S\"),INDEX(INDIRECT($AQ$6),$B15,AT$8),\nIF(OR($AQ$5=\"N\",$AQ$5=\"AP\",$AQ$5=\"AT\",$AQ$5=\"SP\"),INDEX(INDIRECT($AQ$7),$B15,AT$8)))","v":false},{"$f":"IF(OR($AQ$5=\"P\",$AQ$5=\"SS\",$AQ$5=\"S\"),INDEX(INDIRECT($AQ$6),$B15,AU$8),\nIF(OR($AQ$5=\"N\",$AQ$5=\"AP\",$AQ$5=\"AT\",$AQ$5=\"SP\"),INDEX(INDIRECT($AQ$7),$B15,AU$8)))","v":false},{"$nulls":3},{"$f":"IF(OR($AY$5=\"P\",$AY$5=\"SS\",$AY$5=\"S\"),INDEX(INDIRECT($AY$6),$B15,AY$8),\nIF(OR($AY$5=\"N\",$AY$5=\"AP\",$AY$5=\"AT\",$AY$5=\"SP\"),INDEX(INDIRECT($AY$7),$B15,AY$8)))","v":false},{"$f":"IF(OR($AY$5=\"P\",$AY$5=\"SS\",$AY$5=\"S\"),INDEX(INDIRECT($AY$6),$B15,AZ$8),\nIF(OR($AY$5=\"N\",$AY$5=\"AP\",$AY$5=\"AT\",$AY$5=\"SP\"),INDEX(INDIRECT($AY$7),$B15,AZ$8)))","v":false},{"$f":"IF(OR($AY$5=\"P\",$AY$5=\"SS\",$AY$5=\"S\"),INDEX(INDIRECT($AY$6),$B15,BA$8),\nIF(OR($AY$5=\"N\",$AY$5=\"AP\",$AY$5=\"AT\",$AY$5=\"SP\"),INDEX(INDIRECT($AY$7),$B15,BA$8)))","v":false},{"$f":"IF(OR($AY$5=\"P\",$AY$5=\"SS\",$AY$5=\"S\"),INDEX(INDIRECT($AY$6),$B15,BB$8),\nIF(OR($AY$5=\"N\",$AY$5=\"AP\",$AY$5=\"AT\",$AY$5=\"SP\"),INDEX(INDIRECT($AY$7),$B15,BB$8)))","v":false},{"$f":"IF(OR($AY$5=\"P\",$AY$5=\"SS\",$AY$5=\"S\"),INDEX(INDIRECT($AY$6),$B15,BC$8),\nIF(OR($AY$5=\"N\",$AY$5=\"AP\",$AY$5=\"AT\",$AY$5=\"SP\"),INDEX(INDIRECT($AY$7),$B15,BC$8)))","v":false},{"$nulls":3},{"$f":"IF(OR($BG$5=\"P\",$BG$5=\"SS\",$BG$5=\"S\"),INDEX(INDIRECT($BG$6),$B15,BG$8),\nIF(OR($BG$5=\"N\",$BG$5=\"AP\",$BG$5=\"AT\",$BG$5=\"SP\"),INDEX(INDIRECT($BG$7),$B15,BG$8)))","v":false},{"$f":"IF(OR($BG$5=\"P\",$BG$5=\"SS\",$BG$5=\"S\"),INDEX(INDIRECT($BG$6),$B15,BH$8),\nIF(OR($BG$5=\"N\",$BG$5=\"AP\",$BG$5=\"AT\",$BG$5=\"SP\"),INDEX(INDIRECT($BG$7),$B15,BH$8)))","v":false},{"$f":"IF(OR($BG$5=\"P\",$BG$5=\"SS\",$BG$5=\"S\"),INDEX(INDIRECT($BG$6),$B15,BI$8),\nIF(OR($BG$5=\"N\",$BG$5=\"AP\",$BG$5=\"AT\",$BG$5=\"SP\"),INDEX(INDIRECT($BG$7),$B15,BI$8)))","v":false},{"$f":"IF(OR($BG$5=\"P\",$BG$5=\"SS\",$BG$5=\"S\"),INDEX(INDIRECT($BG$6),$B15,BJ$8),\nIF(OR($BG$5=\"N\",$BG$5=\"AP\",$BG$5=\"AT\",$BG$5=\"SP\"),INDEX(INDIRECT($BG$7),$B15,BJ$8)))","v":false},{"$f":"IF(OR($BG$5=\"P\",$BG$5=\"SS\",$BG$5=\"S\"),INDEX(INDIRECT($BG$6),$B15,BK$8),\nIF(OR($BG$5=\"N\",$BG$5=\"AP\",$BG$5=\"AT\",$BG$5=\"SP\"),INDEX(INDIRECT($BG$7),$B15,BK$8)))","v":false},{"$nulls":3},{"$f":"IF(OR($BO$5=\"P\",$BO$5=\"SS\",$BO$5=\"S\"),INDEX(INDIRECT($BO$6),$B15,BO$8),\nIF(OR($BO$5=\"N\",$BO$5=\"AP\",$BO$5=\"AT\",$BO$5=\"SP\"),INDEX(INDIRECT($BO$7),$B15,BO$8)))","v":false},{"$f":"IF(OR($BO$5=\"P\",$BO$5=\"SS\",$BO$5=\"S\"),INDEX(INDIRECT($BO$6),$B15,BP$8),\nIF(OR($BO$5=\"N\",$BO$5=\"AP\",$BO$5=\"AT\",$BO$5=\"SP\"),INDEX(INDIRECT($BO$7),$B15,BP$8)))","v":false},{"$f":"IF(OR($BO$5=\"P\",$BO$5=\"SS\",$BO$5=\"S\"),INDEX(INDIRECT($BO$6),$B15,BQ$8),\nIF(OR($BO$5=\"N\",$BO$5=\"AP\",$BO$5=\"AT\",$BO$5=\"SP\"),INDEX(INDIRECT($BO$7),$B15,BQ$8)))","v":false},{"$f":"IF(OR($BO$5=\"P\",$BO$5=\"SS\",$BO$5=\"S\"),INDEX(INDIRECT($BO$6),$B15,BR$8),\nIF(OR($BO$5=\"N\",$BO$5=\"AP\",$BO$5=\"AT\",$BO$5=\"SP\"),INDEX(INDIRECT($BO$7),$B15,BR$8)))","v":false},{"$f":"IF(OR($BO$5=\"P\",$BO$5=\"SS\",$BO$5=\"S\"),INDEX(INDIRECT($BO$6),$B15,BS$8),\nIF(OR($BO$5=\"N\",$BO$5=\"AP\",$BO$5=\"AT\",$BO$5=\"SP\"),INDEX(INDIRECT($BO$7),$B15,BS$8)))","v":false},{"$nulls":3},{"$f":"IF(OR($BW$5=\"P\",$BW$5=\"SS\",$BW$5=\"S\"),INDEX(INDIRECT($BW$6),$B15,BW$8),\nIF(OR($BW$5=\"N\",$BW$5=\"AP\",$BW$5=\"AT\",$BW$5=\"SP\"),INDEX(INDIRECT($BW$7),$B15,BW$8)))","v":false},{"$f":"IF(OR($BW$5=\"P\",$BW$5=\"SS\",$BW$5=\"S\"),INDEX(INDIRECT($BW$6),$B15,BX$8),\nIF(OR($BW$5=\"N\",$BW$5=\"AP\",$BW$5=\"AT\",$BW$5=\"SP\"),INDEX(INDIRECT($BW$7),$B15,BX$8)))","v":false},{"$f":"IF(OR($BW$5=\"P\",$BW$5=\"SS\",$BW$5=\"S\"),INDEX(INDIRECT($BW$6),$B15,BY$8),\nIF(OR($BW$5=\"N\",$BW$5=\"AP\",$BW$5=\"AT\",$BW$5=\"SP\"),INDEX(INDIRECT($BW$7),$B15,BY$8)))","v":false},{"$f":"IF(OR($BW$5=\"P\",$BW$5=\"SS\",$BW$5=\"S\"),INDEX(INDIRECT($BW$6),$B15,BZ$8),\nIF(OR($BW$5=\"N\",$BW$5=\"AP\",$BW$5=\"AT\",$BW$5=\"SP\"),INDEX(INDIRECT($BW$7),$B15,BZ$8)))","v":false},{"$f":"IF(OR($BW$5=\"P\",$BW$5=\"SS\",$BW$5=\"S\"),INDEX(INDIRECT($BW$6),$B15,CA$8),\nIF(OR($BW$5=\"N\",$BW$5=\"AP\",$BW$5=\"AT\",$BW$5=\"SP\"),INDEX(INDIRECT($BW$7),$B15,CA$8)))","v":false},{"$nulls":3},{"$f":"IF(OR($CE$5=\"P\",$CE$5=\"SS\",$CE$5=\"S\"),INDEX(INDIRECT($CE$6),$B15,CE$8),\nIF(OR($CE$5=\"N\",$CE$5=\"AP\",$CE$5=\"AT\",$CE$5=\"SP\"),INDEX(INDIRECT($CE$7),$B15,CE$8)))","v":false},{"$f":"IF(OR($CE$5=\"P\",$CE$5=\"SS\",$CE$5=\"S\"),INDEX(INDIRECT($CE$6),$B15,CF$8),\nIF(OR($CE$5=\"N\",$CE$5=\"AP\",$CE$5=\"AT\",$CE$5=\"SP\"),INDEX(INDIRECT($CE$7),$B15,CF$8)))","v":false},{"$f":"IF(OR($CE$5=\"P\",$CE$5=\"SS\",$CE$5=\"S\"),INDEX(INDIRECT($CE$6),$B15,CG$8),\nIF(OR($CE$5=\"N\",$CE$5=\"AP\",$CE$5=\"AT\",$CE$5=\"SP\"),INDEX(INDIRECT($CE$7),$B15,CG$8)))","v":false},{"$f":"IF(OR($CE$5=\"P\",$CE$5=\"SS\",$CE$5=\"S\"),INDEX(INDIRECT($CE$6),$B15,CH$8),\nIF(OR($CE$5=\"N\",$CE$5=\"AP\",$CE$5=\"AT\",$CE$5=\"SP\"),INDEX(INDIRECT($CE$7),$B15,CH$8)))","v":false},{"$f":"IF(OR($CE$5=\"P\",$CE$5=\"SS\",$CE$5=\"S\"),INDEX(INDIRECT($CE$6),$B15,CI$8),\nIF(OR($CE$5=\"N\",$CE$5=\"AP\",$CE$5=\"AT\",$CE$5=\"SP\"),INDEX(INDIRECT($CE$7),$B15,CI$8)))","v":false},{"$nulls":3},{"$f":"IF(OR($CM$5=\"P\",$CM$5=\"SS\",$CM$5=\"S\"),INDEX(INDIRECT($CM$6),$B15,CM$8),\nIF(OR($CM$5=\"N\",$CM$5=\"AP\",$CM$5=\"AT\",$CM$5=\"SP\"),INDEX(INDIRECT($CM$7),$B15,CM$8)))","v":false},{"$f":"IF(OR($CM$5=\"P\",$CM$5=\"SS\",$CM$5=\"S\"),INDEX(INDIRECT($CM$6),$B15,CN$8),\nIF(OR($CM$5=\"N\",$CM$5=\"AP\",$CM$5=\"AT\",$CM$5=\"SP\"),INDEX(INDIRECT($CM$7),$B15,CN$8)))","v":false},{"$f":"IF(OR($CM$5=\"P\",$CM$5=\"SS\",$CM$5=\"S\"),INDEX(INDIRECT($CM$6),$B15,CO$8),\nIF(OR($CM$5=\"N\",$CM$5=\"AP\",$CM$5=\"AT\",$CM$5=\"SP\"),INDEX(INDIRECT($CM$7),$B15,CO$8)))","v":false},{"$f":"IF(OR($CM$5=\"P\",$CM$5=\"SS\",$CM$5=\"S\"),INDEX(INDIRECT($CM$6),$B15,CP$8),\nIF(OR($CM$5=\"N\",$CM$5=\"AP\",$CM$5=\"AT\",$CM$5=\"SP\"),INDEX(INDIRECT($CM$7),$B15,CP$8)))","v":false},{"$f":"IF(OR($CM$5=\"P\",$CM$5=\"SS\",$CM$5=\"S\"),INDEX(INDIRECT($CM$6),$B15,CQ$8),\nIF(OR($CM$5=\"N\",$CM$5=\"AP\",$CM$5=\"AT\",$CM$5=\"SP\"),INDEX(INDIRECT($CM$7),$B15,CQ$8)))","v":false},{"$nulls":3},{"$f":"IF(OR($CU$5=\"P\",$CU$5=\"SS\",$CU$5=\"S\"),INDEX(INDIRECT($CU$6),$B15,CU$8),\nIF(OR($CU$5=\"N\",$CU$5=\"AP\",$CU$5=\"AT\",$CU$5=\"SP\"),INDEX(INDIRECT($CU$7),$B15,CU$8)))","v":false},{"$f":"IF(OR($CU$5=\"P\",$CU$5=\"SS\",$CU$5=\"S\"),INDEX(INDIRECT($CU$6),$B15,CV$8),\nIF(OR($CU$5=\"N\",$CU$5=\"AP\",$CU$5=\"AT\",$CU$5=\"SP\"),INDEX(INDIRECT($CU$7),$B15,CV$8)))","v":false},{"$f":"IF(OR($CU$5=\"P\",$CU$5=\"SS\",$CU$5=\"S\"),INDEX(INDIRECT($CU$6),$B15,CW$8),\nIF(OR($CU$5=\"N\",$CU$5=\"AP\",$CU$5=\"AT\",$CU$5=\"SP\"),INDEX(INDIRECT($CU$7),$B15,CW$8)))","v":false},{"$f":"IF(OR($CU$5=\"P\",$CU$5=\"SS\",$CU$5=\"S\"),INDEX(INDIRECT($CU$6),$B15,CX$8),\nIF(OR($CU$5=\"N\",$CU$5=\"AP\",$CU$5=\"AT\",$CU$5=\"SP\"),INDEX(INDIRECT($CU$7),$B15,CX$8)))","v":false},{"$f":"IF(OR($CU$5=\"P\",$CU$5=\"SS\",$CU$5=\"S\"),INDEX(INDIRECT($CU$6),$B15,CY$8),\nIF(OR($CU$5=\"N\",$CU$5=\"AP\",$CU$5=\"AT\",$CU$5=\"SP\"),INDEX(INDIRECT($CU$7),$B15,CY$8)))","v":false},{"$nulls":3},{"$f":"IF(OR($DC$5=\"P\",$DC$5=\"SS\",$DC$5=\"S\"),INDEX(INDIRECT($DC$6),$B15,DC$8),\nIF(OR($DC$5=\"N\",$DC$5=\"AP\",$DC$5=\"AT\",$DC$5=\"SP\"),INDEX(INDIRECT($DC$7),$B15,DC$8)))","v":false},{"$f":"IF(OR($DC$5=\"P\",$DC$5=\"SS\",$DC$5=\"S\"),INDEX(INDIRECT($DC$6),$B15,DD$8),\nIF(OR($DC$5=\"N\",$DC$5=\"AP\",$DC$5=\"AT\",$DC$5=\"SP\"),INDEX(INDIRECT($DC$7),$B15,DD$8)))","v":false},{"$f":"IF(OR($DC$5=\"P\",$DC$5=\"SS\",$DC$5=\"S\"),INDEX(INDIRECT($DC$6),$B15,DE$8),\nIF(OR($DC$5=\"N\",$DC$5=\"AP\",$DC$5=\"AT\",$DC$5=\"SP\"),INDEX(INDIRECT($DC$7),$B15,DE$8)))","v":false},{"$f":"IF(OR($DC$5=\"P\",$DC$5=\"SS\",$DC$5=\"S\"),INDEX(INDIRECT($DC$6),$B15,DF$8),\nIF(OR($DC$5=\"N\",$DC$5=\"AP\",$DC$5=\"AT\",$DC$5=\"SP\"),INDEX(INDIRECT($DC$7),$B15,DF$8)))","v":false},{"$f":"IF(OR($DC$5=\"P\",$DC$5=\"SS\",$DC$5=\"S\"),INDEX(INDIRECT($DC$6),$B15,DG$8),\nIF(OR($DC$5=\"N\",$DC$5=\"AP\",$DC$5=\"AT\",$DC$5=\"SP\"),INDEX(INDIRECT($DC$7),$B15,DG$8)))","v":false},{"$nulls":3},{"$f":"IF(OR($DK$5=\"P\",$DK$5=\"SS\",$DK$5=\"S\"),INDEX(INDIRECT($DK$6),$B15,DK$8),\nIF(OR($DK$5=\"N\",$DK$5=\"AP\",$DK$5=\"AT\",$DK$5=\"SP\"),INDEX(INDIRECT($DK$7),$B15,DK$8)))","v":false},{"$f":"IF(OR($DK$5=\"P\",$DK$5=\"SS\",$DK$5=\"S\"),INDEX(INDIRECT($DK$6),$B15,DL$8),\nIF(OR($DK$5=\"N\",$DK$5=\"AP\",$DK$5=\"AT\",$DK$5=\"SP\"),INDEX(INDIRECT($DK$7),$B15,DL$8)))","v":false},{"$f":"IF(OR($DK$5=\"P\",$DK$5=\"SS\",$DK$5=\"S\"),INDEX(INDIRECT($DK$6),$B15,DM$8),\nIF(OR($DK$5=\"N\",$DK$5=\"AP\",$DK$5=\"AT\",$DK$5=\"SP\"),INDEX(INDIRECT($DK$7),$B15,DM$8)))","v":false},{"$f":"IF(OR($DK$5=\"P\",$DK$5=\"SS\",$DK$5=\"S\"),INDEX(INDIRECT($DK$6),$B15,DN$8),\nIF(OR($DK$5=\"N\",$DK$5=\"AP\",$DK$5=\"AT\",$DK$5=\"SP\"),INDEX(INDIRECT($DK$7),$B15,DN$8)))","v":false},{"$f":"IF(OR($DK$5=\"P\",$DK$5=\"SS\",$DK$5=\"S\"),INDEX(INDIRECT($DK$6),$B15,DO$8),\nIF(OR($DK$5=\"N\",$DK$5=\"AP\",$DK$5=\"AT\",$DK$5=\"SP\"),INDEX(INDIRECT($DK$7),$B15,DO$8)))","v":false},{"$nulls":3},{"$f":"IF(OR($DS$5=\"P\",$DS$5=\"SS\",$DS$5=\"S\"),INDEX(INDIRECT($DS$6),$B15,DS$8),\nIF(OR($DS$5=\"N\",$DS$5=\"AP\",$DS$5=\"AT\",$DS$5=\"SP\"),INDEX(INDIRECT($DS$7),$B15,DS$8)))","v":false},{"$f":"IF(OR($DS$5=\"P\",$DS$5=\"SS\",$DS$5=\"S\"),INDEX(INDIRECT($DS$6),$B15,DT$8),\nIF(OR($DS$5=\"N\",$DS$5=\"AP\",$DS$5=\"AT\",$DS$5=\"SP\"),INDEX(INDIRECT($DS$7),$B15,DT$8)))","v":false},{"$f":"IF(OR($DS$5=\"P\",$DS$5=\"SS\",$DS$5=\"S\"),INDEX(INDIRECT($DS$6),$B15,DU$8),\nIF(OR($DS$5=\"N\",$DS$5=\"AP\",$DS$5=\"AT\",$DS$5=\"SP\"),INDEX(INDIRECT($DS$7),$B15,DU$8)))","v":false},{"$f":"IF(OR($DS$5=\"P\",$DS$5=\"SS\",$DS$5=\"S\"),INDEX(INDIRECT($DS$6),$B15,DV$8),\nIF(OR($DS$5=\"N\",$DS$5=\"AP\",$DS$5=\"AT\",$DS$5=\"SP\"),INDEX(INDIRECT($DS$7),$B15,DV$8)))","v":false},{"$f":"IF(OR($DS$5=\"P\",$DS$5=\"SS\",$DS$5=\"S\"),INDEX(INDIRECT($DS$6),$B15,DW$8),\nIF(OR($DS$5=\"N\",$DS$5=\"AP\",$DS$5=\"AT\",$DS$5=\"SP\"),INDEX(INDIRECT($DS$7),$B15,DW$8)))","v":false},{"$nulls":3},{"$f":"IF(OR($EA$5=\"P\",$EA$5=\"SS\",$EA$5=\"S\"),INDEX(INDIRECT($EA$6),$B15,EA$8),\nIF(OR($EA$5=\"N\",$EA$5=\"AP\",$EA$5=\"AT\",$EA$5=\"SP\"),INDEX(INDIRECT($EA$7),$B15,EA$8)))","v":false},{"$f":"IF(OR($EA$5=\"P\",$EA$5=\"SS\",$EA$5=\"S\"),INDEX(INDIRECT($EA$6),$B15,EB$8),\nIF(OR($EA$5=\"N\",$EA$5=\"AP\",$EA$5=\"AT\",$EA$5=\"SP\"),INDEX(INDIRECT($EA$7),$B15,EB$8)))","v":false},{"$f":"IF(OR($EA$5=\"P\",$EA$5=\"SS\",$EA$5=\"S\"),INDEX(INDIRECT($EA$6),$B15,EC$8),\nIF(OR($EA$5=\"N\",$EA$5=\"AP\",$EA$5=\"AT\",$EA$5=\"SP\"),INDEX(INDIRECT($EA$7),$B15,EC$8)))","v":false},{"$f":"IF(OR($EA$5=\"P\",$EA$5=\"SS\",$EA$5=\"S\"),INDEX(INDIRECT($EA$6),$B15,ED$8),\nIF(OR($EA$5=\"N\",$EA$5=\"AP\",$EA$5=\"AT\",$EA$5=\"SP\"),INDEX(INDIRECT($EA$7),$B15,ED$8)))","v":false},{"$f":"IF(OR($EA$5=\"P\",$EA$5=\"SS\",$EA$5=\"S\"),INDEX(INDIRECT($EA$6),$B15,EE$8),\nIF(OR($EA$5=\"N\",$EA$5=\"AP\",$EA$5=\"AT\",$EA$5=\"SP\"),INDEX(INDIRECT($EA$7),$B15,EE$8)))","v":false},{"$nulls":3},{"$f":"IF(OR($EI$5=\"P\",$EI$5=\"SS\",$EI$5=\"S\"),INDEX(INDIRECT($EI$6),$B15,EI$8),\nIF(OR($EI$5=\"N\",$EI$5=\"AP\",$EI$5=\"AT\",$EI$5=\"SP\"),INDEX(INDIRECT($EI$7),$B15,EI$8)))","v":false},{"$f":"IF(OR($EI$5=\"P\",$EI$5=\"SS\",$EI$5=\"S\"),INDEX(INDIRECT($EI$6),$B15,EJ$8),\nIF(OR($EI$5=\"N\",$EI$5=\"AP\",$EI$5=\"AT\",$EI$5=\"SP\"),INDEX(INDIRECT($EI$7),$B15,EJ$8)))","v":false},{"$f":"IF(OR($EI$5=\"P\",$EI$5=\"SS\",$EI$5=\"S\"),INDEX(INDIRECT($EI$6),$B15,EK$8),\nIF(OR($EI$5=\"N\",$EI$5=\"AP\",$EI$5=\"AT\",$EI$5=\"SP\"),INDEX(INDIRECT($EI$7),$B15,EK$8)))","v":false},{"$f":"IF(OR($EI$5=\"P\",$EI$5=\"SS\",$EI$5=\"S\"),INDEX(INDIRECT($EI$6),$B15,EL$8),\nIF(OR($EI$5=\"N\",$EI$5=\"AP\",$EI$5=\"AT\",$EI$5=\"SP\"),INDEX(INDIRECT($EI$7),$B15,EL$8)))","v":false},{"$f":"IF(OR($EI$5=\"P\",$EI$5=\"SS\",$EI$5=\"S\"),INDEX(INDIRECT($EI$6),$B15,EM$8),\nIF(OR($EI$5=\"N\",$EI$5=\"AP\",$EI$5=\"AT\",$EI$5=\"SP\"),INDEX(INDIRECT($EI$7),$B15,EM$8)))","v":false},{"$nulls":3},{"$f":"IF(OR($EQ$5=\"P\",$EQ$5=\"SS\",$EQ$5=\"S\"),INDEX(INDIRECT($EQ$6),$B15,EQ$8),\nIF(OR($EQ$5=\"N\",$EQ$5=\"AP\",$EQ$5=\"AT\",$EQ$5=\"SP\"),INDEX(INDIRECT($EQ$7),$B15,EQ$8)))","v":false},{"$f":"IF(OR($EQ$5=\"P\",$EQ$5=\"SS\",$EQ$5=\"S\"),INDEX(INDIRECT($EQ$6),$B15,ER$8),\nIF(OR($EQ$5=\"N\",$EQ$5=\"AP\",$EQ$5=\"AT\",$EQ$5=\"SP\"),INDEX(INDIRECT($EQ$7),$B15,ER$8)))","v":false},{"$f":"IF(OR($EQ$5=\"P\",$EQ$5=\"SS\",$EQ$5=\"S\"),INDEX(INDIRECT($EQ$6),$B15,ES$8),\nIF(OR($EQ$5=\"N\",$EQ$5=\"AP\",$EQ$5=\"AT\",$EQ$5=\"SP\"),INDEX(INDIRECT($EQ$7),$B15,ES$8)))","v":false},{"$f":"IF(OR($EQ$5=\"P\",$EQ$5=\"SS\",$EQ$5=\"S\"),INDEX(INDIRECT($EQ$6),$B15,ET$8),\nIF(OR($EQ$5=\"N\",$EQ$5=\"AP\",$EQ$5=\"AT\",$EQ$5=\"SP\"),INDEX(INDIRECT($EQ$7),$B15,ET$8)))","v":false},{"$f":"IF(OR($EQ$5=\"P\",$EQ$5=\"SS\",$EQ$5=\"S\"),INDEX(INDIRECT($EQ$6),$B15,EU$8),\nIF(OR($EQ$5=\"N\",$EQ$5=\"AP\",$EQ$5=\"AT\",$EQ$5=\"SP\"),INDEX(INDIRECT($EQ$7),$B15,EU$8)))","v":false},{"$nulls":3},{"$f":"IF(OR($EY$5=\"P\",$EY$5=\"SS\",$EY$5=\"S\"),INDEX(INDIRECT($EY$6),$B15,EY$8),\nIF(OR($EY$5=\"N\",$EY$5=\"AP\",$EY$5=\"AT\",$EY$5=\"SP\"),INDEX(INDIRECT($EY$7),$B15,EY$8)))","v":false},{"$f":"IF(OR($EY$5=\"P\",$EY$5=\"SS\",$EY$5=\"S\"),INDEX(INDIRECT($EY$6),$B15,EZ$8),\nIF(OR($EY$5=\"N\",$EY$5=\"AP\",$EY$5=\"AT\",$EY$5=\"SP\"),INDEX(INDIRECT($EY$7),$B15,EZ$8)))","v":false},{"$f":"IF(OR($EY$5=\"P\",$EY$5=\"SS\",$EY$5=\"S\"),INDEX(INDIRECT($EY$6),$B15,FA$8),\nIF(OR($EY$5=\"N\",$EY$5=\"AP\",$EY$5=\"AT\",$EY$5=\"SP\"),INDEX(INDIRECT($EY$7),$B15,FA$8)))","v":false},{"$f":"IF(OR($EY$5=\"P\",$EY$5=\"SS\",$EY$5=\"S\"),INDEX(INDIRECT($EY$6),$B15,FB$8),\nIF(OR($EY$5=\"N\",$EY$5=\"AP\",$EY$5=\"AT\",$EY$5=\"SP\"),INDEX(INDIRECT($EY$7),$B15,FB$8)))","v":false},{"$f":"IF(OR($EY$5=\"P\",$EY$5=\"SS\",$EY$5=\"S\"),INDEX(INDIRECT($EY$6),$B15,FC$8),\nIF(OR($EY$5=\"N\",$EY$5=\"AP\",$EY$5=\"AT\",$EY$5=\"SP\"),INDEX(INDIRECT($EY$7),$B15,FC$8)))","v":false}]
["Spend on energy as a percentage of total expenditure",8,{"$nulls":3},{"v":0.01,"d":"1.0%"},null,{"v":0.015,"d":"1.5%"},{"v":0.02,"d":"2.0%"},{"$nulls":4},false,null,false,false,{"$nulls":4},false,null,false,false,{"$nulls":4},false,null,false,false,{"$nulls":4},false,null,false,false,{"$nulls":4},false,null,false,false,{"$nulls":4},false,null,false,false,{"$nulls":4},false,null,false,false,{"$nulls":4},false,null,false,false,{"$nulls":4},false,null,false,false,{"$nulls":4},false,null,false,false,{"$nulls":4},false,null,false,false,{"$nulls":4},false,null,false,false,{"$nulls":4},false,null,false,false,{"$nulls":4},false,null,false,false,{"$nulls":4},false,null,false,false,{"$nulls":4},false,null,false,false,{"$nulls":4},false,null,false,false,{"$nulls":4},false,null,false,false,{"$nulls":4},false,null,false,false]
["Senior leaders as a percentage of workforce",9,null,null,{"$f":"IF(OR($C$5=\"P\",$C$5=\"SS\",$C$5=\"S\"),INDEX(INDIRECT($C$6),$B17,E$8),\nIF(OR($C$5=\"N\",$C$5=\"AP\",$C$5=\"AT\",$C$5=\"SP\"),INDEX(INDIRECT($C$7),$B17,E$8)))","v":{"v":0.05,"d":"5.0%"}},{"v":0.055,"d":"5.5%"},{"$f":"IF(OR($C$5=\"P\",$C$5=\"SS\",$C$5=\"S\"),INDEX(INDIRECT($C$6),$B17,G$8),\nIF(OR($C$5=\"N\",$C$5=\"AP\",$C$5=\"AT\",$C$5=\"SP\"),INDEX(INDIRECT($C$7),$B17,G$8)))","v":{"v":0.06,"d":"6.0%"}},{"v":0.07,"d":"7.0%"},{"v":0.08,"d":"8.0%"},{"$nulls":3},{"$f":"IF(OR($K$5=\"P\",$K$5=\"SS\",$K$5=\"S\"),INDEX(INDIRECT($K$6),$B17,M$8),\nIF(OR($K$5=\"N\",$K$5=\"AP\",$K$5=\"AT\",$K$5=\"SP\"),INDEX(INDIRECT($K$7),$B17,M$8)))","v":false},false,{"$f":"IF(OR($K$5=\"P\",$K$5=\"SS\",$K$5=\"S\"),INDEX(INDIRECT($K$6),$B17,O$8),\nIF(OR($K$5=\"N\",$K$5=\"AP\",$K$5=\"AT\",$K$5=\"SP\"),INDEX(INDIRECT($K$7),$B17,O$8)))","v":false},false,false,{"$nulls":3},{"$f":"IF(OR($S$5=\"P\",$S$5=\"SS\",$S$5=\"S\"),INDEX(INDIRECT($S$6),$B17,U$8),\nIF(OR($S$5=\"N\",$S$5=\"AP\",$S$5=\"AT\",$S$5=\"SP\"),INDEX(INDIRECT($S$7),$B17,U$8)))","v":false},false,{"$f":"IF(OR($S$5=\"P\",$S$5=\"SS\",$S$5=\"S\"),INDEX(INDIRECT($S$6),$B17,W$8),\nIF(OR($S$5=\"N\",$S$5=\"AP\",$S$5=\"AT\",$S$5=\"SP\"),INDEX(INDIRECT($S$7),$B17,W$8)))","v":false},false,false,{"$nulls":3},{"$f":"IF(OR($AA$5=\"P\",$AA$5=\"SS\",$AA$5=\"S\"),INDEX(INDIRECT($AA$6),$B17,AC$8),\nIF(OR($AA$5=\"N\",$AA$5=\"AP\",$AA$5=\"AT\",$AA$5=\"SP\"),INDEX(INDIRECT($AA$7),$B17,AC$8)))","v":false},false,{"$f":"IF(OR($AA$5=\"P\",$AA$5=\"SS\",$AA$5=\"S\"),INDEX(INDIRECT($AA$6),$B17,AE$8),\nIF(OR($AA$5=\"N\",$AA$5=\"AP\",$AA$5=\"AT\",$AA$5=\"SP\"),INDEX(INDIRECT($AA$7),$B17,AE$8)))","v":false},false,false,{"$nulls":3},{"$f":"IF(OR($AI$5=\"P\",$AI$5=\"SS\",$AI$5=\"S\"),INDEX(INDIRECT($AI$6),$B17,AK$8),\nIF(OR($AI$5=\"N\",$AI$5=\"AP\",$AI$5=\"AT\",$AI$5=\"SP\"),INDEX(INDIRECT($AI$7),$B17,AK$8)))","v":false},false,{"$f":"IF(OR($AI$5=\"P\",$AI$5=\"SS\",$AI$5=\"S\"),INDEX(INDIRECT($AI$6),$B17,AM$8),\nIF(OR($AI$5=\"N\",$AI$5=\"AP\",$AI$5=\"AT\",$AI$5=\"SP\"),INDEX(INDIRECT($AI$7),$B17,AM$8)))","v":false},false,false,{"$nulls":3},{"$f":"IF(OR($AQ$5=\"P\",$AQ$5=\"SS\",$AQ$5=\"S\"),INDEX(INDIRECT($AQ$6),$B17,AS$8),\nIF(OR($AQ$5=\"N\",$AQ$5=\"AP\",$AQ$5=\"AT\",$AQ$5=\"SP\"),INDEX(INDIRECT($AQ$7),$B17,AS$8)))","v":false},false,{"$f":"IF(OR($AQ$5=\"P\",$AQ$5=\"SS\",$AQ$5=\"S\"),INDEX(INDIRECT($AQ$6),$B17,AU$8),\nIF(OR($AQ$5=\"N\",$AQ$5=\"AP\",$AQ$5=\"AT\",$AQ$5=\"SP\"),INDEX(INDIRECT($AQ$7),$B17,AU$8)))","v":false},false,false,{"$nulls":3},{"$f":"IF(OR($AY$5=\"P\",$AY$5=\"SS\",$AY$5=\"S\"),INDEX(INDIRECT($AY$6),$B17,BA$8),\nIF(OR($AY$5=\"N\",$AY$5=\"AP\",$AY$5=\"AT\",$AY$5=\"SP\"),INDEX(INDIRECT($AY$7),$B17,BA$8)))","v":false},false,{"$f":"IF(OR($AY$5=\"P\",$AY$5=\"SS\",$AY$5=\"S\"),INDEX(INDIRECT($AY$6),$B17,BC$8),\nIF(OR($AY$5=\"N\",$AY$5=\"AP\",$AY$5=\"AT\",$AY$5=\"SP\"),INDEX(INDIRECT($AY$7),$B17,BC$8)))","v":false},false,false,{"$nulls":3},{"$f":"IF(OR($BG$5=\"P\",$BG$5=\"SS\",$BG$5=\"S\"),INDEX(INDIRECT($BG$6),$B17,BI$8),\nIF(OR($BG$5=\"N\",$BG$5=\"AP\",$BG$5=\"AT\",$BG$5=\"SP\"),INDEX(INDIRECT($BG$7),$B17,BI$8)))","v":false},false,{"$f":"IF(OR($BG$5=\"P\",$BG$5=\"SS\",$BG$5=\"S\"),INDEX(INDIRECT($BG$6),$B17,BK$8),\nIF(OR($BG$5=\"N\",$BG$5=\"AP\",$BG$5=\"AT\",$BG$5=\"SP\"),INDEX(INDIRECT($BG$7),$B17,BK$8)))","v":false},false,false,{"$nulls":3},{"$f":"IF(OR($BO$5=\"P\",$BO$5=\"SS\",$BO$5=\"S\"),INDEX(INDIRECT($BO$6),$B17,BQ$8),\nIF(OR($BO$5=\"N\",$BO$5=\"AP\",$BO$5=\"AT\",$BO$5=\"SP\"),INDEX(INDIRECT($BO$7),$B17,BQ$8)))","v":false},false,{"$f":"IF(OR($BO$5=\"P\",$BO$5=\"SS\",$BO$5=\"S\"),INDEX(INDIRECT($BO$6),$B17,BS$8),\nIF(OR($BO$5=\"N\",$BO$5=\"AP\",$BO$5=\"AT\",$BO$5=\"SP\"),INDEX(INDIRECT($BO$7),$B17,BS$8)))","v":false},false,false,{"$nulls":3},{"$f":"IF(OR($BW$5=\"P\",$BW$5=\"SS\",$BW$5=\"S\"),INDEX(INDIRECT($BW$6),$B17,BY$8),\nIF(OR($BW$5=\"N\",$BW$5=\"AP\",$BW$5=\"AT\",$BW$5=\"SP\"),INDEX(INDIRECT($BW$7),$B17,BY$8)))","v":false},false,{"$f":"IF(OR($BW$5=\"P\",$BW$5=\"SS\",$BW$5=\"S\"),INDEX(INDIRECT($BW$6),$B17,CA$8),\nIF(OR($BW$5=\"N\",$BW$5=\"AP\",$BW$5=\"AT\",$BW$5=\"SP\"),INDEX(INDIRECT($BW$7),$B17,CA$8)))","v":false},false,false,{"$nulls":3},{"$f":"IF(OR($CE$5=\"P\",$CE$5=\"SS\",$CE$5=\"S\"),INDEX(INDIRECT($CE$6),$B17,CG$8),\nIF(OR($CE$5=\"N\",$CE$5=\"AP\",$CE$5=\"AT\",$CE$5=\"SP\"),INDEX(INDIRECT($CE$7),$B17,CG$8)))","v":false},false,{"$f":"IF(OR($CE$5=\"P\",$CE$5=\"SS\",$CE$5=\"S\"),INDEX(INDIRECT($CE$6),$B17,CI$8),\nIF(OR($CE$5=\"N\",$CE$5=\"AP\",$CE$5=\"AT\",$CE$5=\"SP\"),INDEX(INDIRECT($CE$7),$B17,CI$8)))","v":false},false,false,{"$nulls":3},{"$f":"IF(OR($CM$5=\"P\",$CM$5=\"SS\",$CM$5=\"S\"),INDEX(INDIRECT($CM$6),$B17,CO$8),\nIF(OR($CM$5=\"N\",$CM$5=\"AP\",$CM$5=\"AT\",$CM$5=\"SP\"),INDEX(INDIRECT($CM$7),$B17,CO$8)))","v":false},false,{"$f":"IF(OR($CM$5=\"P\",$CM$5=\"SS\",$CM$5=\"S\"),INDEX(INDIRECT($CM$6),$B17,CQ$8),\nIF(OR($CM$5=\"N\",$CM$5=\"AP\",$CM$5=\"AT\",$CM$5=\"SP\"),INDEX(INDIRECT($CM$7),$B17,CQ$8)))","v":false},false,false,{"$nulls":3},{"$f":"IF(OR($CU$5=\"P\",$CU$5=\"SS\",$CU$5=\"S\"),INDEX(INDIRECT($CU$6),$B17,CW$8),\nIF(OR($CU$5=\"N\",$CU$5=\"AP\",$CU$5=\"AT\",$CU$5=\"SP\"),INDEX(INDIRECT($CU$7),$B17,CW$8)))","v":false},false,{"$f":"IF(OR($CU$5=\"P\",$CU$5=\"SS\",$CU$5=\"S\"),INDEX(INDIRECT($CU$6),$B17,CY$8),\nIF(OR($CU$5=\"N\",$CU$5=\"AP\",$CU$5=\"AT\",$CU$5=\"SP\"),INDEX(INDIRECT($CU$7),$B17,CY$8)))","v":false},false,false,{"$nulls":3},{"$f":"IF(OR($DC$5=\"P\",$DC$5=\"SS\",$DC$5=\"S\"),INDEX(INDIRECT($DC$6),$B17,DE$8),\nIF(OR($DC$5=\"N\",$DC$5=\"AP\",$DC$5=\"AT\",$DC$5=\"SP\"),INDEX(INDIRECT($DC$7),$B17,DE$8)))","v":false},false,{"$f":"IF(OR($DC$5=\"P\",$DC$5=\"SS\",$DC$5=\"S\"),INDEX(INDIRECT($DC$6),$B17,DG$8),\nIF(OR($DC$5=\"N\",$DC$5=\"AP\",$DC$5=\"AT\",$DC$5=\"SP\"),INDEX(INDIRECT($DC$7),$B17,DG$8)))","v":false},false,false,{"$nulls":3},{"$f":"IF(OR($DK$5=\"P\",$DK$5=\"SS\",$DK$5=\"S\"),INDEX(INDIRECT($DK$6),$B17,DM$8),\nIF(OR($DK$5=\"N\",$DK$5=\"AP\",$DK$5=\"AT\",$DK$5=\"SP\"),INDEX(INDIRECT($DK$7),$B17,DM$8)))","v":false},false,{"$f":"IF(OR($DK$5=\"P\",$DK$5=\"SS\",$DK$5=\"S\"),INDEX(INDIRECT($DK$6),$B17,DO$8),\nIF(OR($DK$5=\"N\",$DK$5=\"AP\",$DK$5=\"AT\",$DK$5=\"SP\"),INDEX(INDIRECT($DK$7),$B17,DO$8)))","v":false},false,false,{"$nulls":3},{"$f":"IF(OR($DS$5=\"P\",$DS$5=\"SS\",$DS$5=\"S\"),INDEX(INDIRECT($DS$6),$B17,DU$8),\nIF(OR($DS$5=\"N\",$DS$5=\"AP\",$DS$5=\"AT\",$DS$5=\"SP\"),INDEX(INDIRECT($DS$7),$B17,DU$8)))","v":false},false,{"$f":"IF(OR($DS$5=\"P\",$DS$5=\"SS\",$DS$5=\"S\"),INDEX(INDIRECT($DS$6),$B17,DW$8),\nIF(OR($DS$5=\"N\",$DS$5=\"AP\",$DS$5=\"AT\",$DS$5=\"SP\"),INDEX(INDIRECT($DS$7),$B17,DW$8)))","v":false},false,false,{"$nulls":3},{"$f":"IF(OR($EA$5=\"P\",$EA$5=\"SS\",$EA$5=\"S\"),INDEX(INDIRECT($EA$6),$B17,EC$8),\nIF(OR($EA$5=\"N\",$EA$5=\"AP\",$EA$5=\"AT\",$EA$5=\"SP\"),INDEX(INDIRECT($EA$7),$B17,EC$8)))","v":false},false,{"$f":"IF(OR($EA$5=\"P\",$EA$5=\"SS\",$EA$5=\"S\"),INDEX(INDIRECT($EA$6),$B17,EE$8),\nIF(OR($EA$5=\"N\",$EA$5=\"AP\",$EA$5=\"AT\",$EA$5=\"SP\"),INDEX(INDIRECT($EA$7),$B17,EE$8)))","v":false},false,false,{"$nulls":3},{"$f":"IF(OR($EI$5=\"P\",$EI$5=\"SS\",$EI$5=\"S\"),INDEX(INDIRECT($EI$6),$B17,EK$8),\nIF(OR($EI$5=\"N\",$EI$5=\"AP\",$EI$5=\"AT\",$EI$5=\"SP\"),INDEX(INDIRECT($EI$7),$B17,EK$8)))","v":false},false,{"$f":"IF(OR($EI$5=\"P\",$EI$5=\"SS\",$EI$5=\"S\"),INDEX(INDIRECT($EI$6),$B17,EM$8),\nIF(OR($EI$5=\"N\",$EI$5=\"AP\",$EI$5=\"AT\",$EI$5=\"SP\"),INDEX(INDIRECT($EI$7),$B17,EM$8)))","v":false},false,false,{"$nulls":3},{"$f":"IF(OR($EQ$5=\"P\",$EQ$5=\"SS\",$EQ$5=\"S\"),INDEX(INDIRECT($EQ$6),$B17,ES$8),\nIF(OR($EQ$5=\"N\",$EQ$5=\"AP\",$EQ$5=\"AT\",$EQ$5=\"SP\"),INDEX(INDIRECT($EQ$7),$B17,ES$8)))","v":false},false,{"$f":"IF(OR($EQ$5=\"P\",$EQ$5=\"SS\",$EQ$5=\"S\"),INDEX(INDIRECT($EQ$6),$B17,EU$8),\nIF(OR($EQ$5=\"N\",$EQ$5=\"AP\",$EQ$5=\"AT\",$EQ$5=\"SP\"),INDEX(INDIRECT($EQ$7),$B17,EU$8)))","v":false},false,false,{"$nulls":3},{"$f":"IF(OR($EY$5=\"P\",$EY$5=\"SS\",$EY$5=\"S\"),INDEX(INDIRECT($EY$6),$B17,FA$8),\nIF(OR($EY$5=\"N\",$EY$5=\"AP\",$EY$5=\"AT\",$EY$5=\"SP\"),INDEX(INDIRECT($EY$7),$B17,FA$8)))","v":false},false,{"$f":"IF(OR($EY$5=\"P\",$EY$5=\"SS\",$EY$5=\"S\"),INDEX(INDIRECT($EY$6),$B17,FC$8),\nIF(OR($EY$5=\"N\",$EY$5=\"AP\",$EY$5=\"AT\",$EY$5=\"SP\"),INDEX(INDIRECT($EY$7),$B17,FC$8)))","v":false},false,false]
["Pupil to teacher ratio",10,{"$f":"IF(OR($C$5=\"P\",$C$5=\"SS\",$C$5=\"S\"),INDEX(INDIRECT($C$6),$B18,C$8),\nIF(OR($C$5=\"N\",$C$5=\"AP\",$C$5=\"AT\",$C$5=\"SP\"),INDEX(INDIRECT($C$7),$B18,C$8)))","v":{"v":14,"d":"14.0"}},{"$f":"IF(OR($C$5=\"P\",$C$5=\"SS\",$C$5=\"S\"),INDEX(INDIRECT($C$6),$B18,D$8),\nIF(OR($C$5=\"N\",$C$5=\"AP\",$C$5=\"AT\",$C$5=\"SP\"),INDEX(INDIRECT($C$7),$B18,D$8)))","v":{"v":15,"d":"15.0"}},{"$f":"IF(OR($C$5=\"P\",$C$5=\"SS\",$C$5=\"S\"),INDEX(INDIRECT($C$6),$B18,E$8),\nIF(OR($C$5=\"N\",$C$5=\"AP\",$C$5=\"AT\",$C$5=\"SP\"),INDEX(INDIRECT($C$7),$B18,E$8)))","v":{"v":16,"d":"16.0"}},{"v":16,"d":"16.0"},{"$f":"IF(OR($C$5=\"P\",$C$5=\"SS\",$C$5=\"S\"),INDEX(INDIRECT($C$6),$B18,G$8),\nIF(OR($C$5=\"N\",$C$5=\"AP\",$C$5=\"AT\",$C$5=\"SP\"),INDEX(INDIRECT($C$7),$B18,G$8)))","v":16.5},17.5,18.5,null,{"$f":"IF(OR($K$5=\"P\",$K$5=\"SS\",$K$5=\"S\"),INDEX(INDIRECT($K$6),$B18,K$8),\nIF(OR($K$5=\"N\",$K$5=\"AP\",$K$5=\"AT\",$K$5=\"SP\"),INDEX(INDIRECT($K$7),$B18,K$8)))","v":false},{"$f":"IF(OR($K$5=\"P\",$K$5=\"SS\",$K$5=\"S\"),INDEX(INDIRECT($K$6),$B18,L$8),\nIF(OR($K$5=\"N\",$K$5=\"AP\",$K$5=\"AT\",$K$5=\"SP\"),INDEX(INDIRECT($K$7),$B18,L$8)))","v":false},{"$f":"IF(OR($K$5=\"P\",$K$5=\"SS\",$K$5=\"S\"),INDEX(INDIRECT($K$6),$B18,M$8),\nIF(OR($K$5=\"N\",$K$5=\"AP\",$K$5=\"AT\",$K$5=\"SP\"),INDEX(INDIRECT($K$7),$B18,M$8)))","v":false},false,{"$f":"IF(OR($K$5=\"P\",$K$5=\"SS\",$K$5=\"S\"),INDEX(INDIRECT($K$6),$B18,O$8),\nIF(OR($K$5=\"N\",$K$5=\"AP\",$K$5=\"AT\",$K$5=\"SP\"),INDEX(INDIRECT($K$7),$B18,O$8)))","v":false},false,false,null,{"$f":"IF(OR($S$5=\"P\",$S$5=\"SS\",$S$5=\"S\"),INDEX(INDIRECT($S$6),$B18,S$8),\nIF(OR($S$5=\"N\",$S$5=\"AP\",$S$5=\"AT\",$S$5=\"SP\"),INDEX(INDIRECT($S$7),$B18,S$8)))","v":false},{"$f":"IF(OR($S$5=\"P\",$S$5=\"SS\",$S$5=\"S\"),INDEX(INDIRECT($S$6),$B18,T$8),\nIF(OR($S$5=\"N\",$S$5=\"AP\",$S$5=\"AT\",$S$5=\"SP\"),INDEX(INDIRECT($S$7),$B18,T$8)))","v":false},{"$f":"IF(OR($S$5=\"P\",$S$5=\"SS\",$S$5=\"S\"),INDEX(INDIRECT($S$6),$B18,U$8),\nIF(OR($S$5=\"N\",$S$5=\"AP\",$S$5=\"AT\",$S$5=\"SP\"),INDEX(INDIRECT($S$7),$B18,U$8)))","v":false},false,{"$f":"IF(OR($S$5=\"P\",$S$5=\"SS\",$S$5=\"S\"),INDEX(INDIRECT($S$6),$B18,W$8),\nIF(OR($S$5=\"N\",$S$5=\"AP\",$S$5=\"AT\",$S$5=\"SP\"),INDEX(INDIRECT($S$7),$B18,W$8)))","v":false},false,false,null,{"$f":"IF(OR($AA$5=\"P\",$AA$5=\"SS\",$AA$5=\"S\"),INDEX(INDIRECT($AA$6),$B18,AA$8),\nIF(OR($AA$5=\"N\",$AA$5=\"AP\",$AA$5=\"AT\",$AA$5=\"SP\"),INDEX(INDIRECT($AA$7),$B18,AA$8)))","v":false},{"$f":"IF(OR($AA$5=\"P\",$AA$5=\"SS\",$AA$5=\"S\"),INDEX(INDIRECT($AA$6),$B18,AB$8),\nIF(OR($AA$5=\"N\",$AA$5=\"AP\",$AA$5=\"AT\",$AA$5=\"SP\"),INDEX(INDIRECT($AA$7),$B18,AB$8)))","v":false},{"$f":"IF(OR($AA$5=\"P\",$AA$5=\"SS\",$AA$5=\"S\"),INDEX(INDIRECT($AA$6),$B18,AC$8),\nIF(OR($AA$5=\"N\",$AA$5=\"AP\",$AA$5=\"AT\",$AA$5=\"SP\"),INDEX(INDIRECT($AA$7),$B18,AC$8)))","v":false},false,{"$f":"IF(OR($AA$5=\"P\",$AA$5=\"SS\",$AA$5=\"S\"),INDEX(INDIRECT($AA$6),$B18,AE$8),\nIF(OR($AA$5=\"N\",$AA$5=\"AP\",$AA$5=\"AT\",$AA$5=\"SP\"),INDEX(INDIRECT($AA$7),$B18,AE$8)))","v":false},false,false,null,{"$f":"IF(OR($AI$5=\"P\",$AI$5=\"SS\",$AI$5=\"S\"),INDEX(INDIRECT($AI$6),$B18,AI$8),\nIF(OR($AI$5=\"N\",$AI$5=\"AP\",$AI$5=\"AT\",$AI$5=\"SP\"),INDEX(INDIRECT($AI$7),$B18,AI$8)))","v":false},{"$f":"IF(OR($AI$5=\"P\",$AI$5=\"SS\",$AI$5=\"S\"),INDEX(INDIRECT($AI$6),$B18,AJ$8),\nIF(OR($AI$5=\"N\",$AI$5=\"AP\",$AI$5=\"AT\",$AI$5=\"SP\"),INDEX(INDIRECT($AI$7),$B18,AJ$8)))","v":false},{"$f":"IF(OR($AI$5=\"P\",$AI$5=\"SS\",$AI$5=\"S\"),INDEX(INDIRECT($AI$6),$B18,AK$8),\nIF(OR($AI$5=\"N\",$AI$5=\"AP\",$AI$5=\"AT\",$AI$5=\"SP\"),INDEX(INDIRECT($AI$7),$B18,AK$8)))","v":false},false,{"$f":"IF(OR($AI$5=\"P\",$AI$5=\"SS\",$AI$5=\"S\"),INDEX(INDIRECT($AI$6),$B18,AM$8),\nIF(OR($AI$5=\"N\",$AI$5=\"AP\",$AI$5=\"AT\",$AI$5=\"SP\"),INDEX(INDIRECT($AI$7),$B18,AM$8)))","v":false},false,false,null,{"$f":"IF(OR($AQ$5=\"P\",$AQ$5=\"SS\",$AQ$5=\"S\"),INDEX(INDIRECT($AQ$6),$B18,AQ$8),\nIF(OR($AQ$5=\"N\",$AQ$5=\"AP\",$AQ$5=\"AT\",$AQ$5=\"SP\"),INDEX(INDIRECT($AQ$7),$B18,AQ$8)))","v":false},{"$f":"IF(OR($AQ$5=\"P\",$AQ$5=\"SS\",$AQ$5=\"S\"),INDEX(INDIRECT($AQ$6),$B18,AR$8),\nIF(OR($AQ$5=\"N\",$AQ$5=\"AP\",$AQ$5=\"AT\",$AQ$5=\"SP\"),INDEX(INDIRECT($AQ$7),$B18,AR$8)))","v":false},{"$f":"IF(OR($AQ$5=\"P\",$AQ$5=\"SS\",$AQ$5=\"S\"),INDEX(INDIRECT($AQ$6),$B18,AS$8),\nIF(OR($AQ$5=\"N\",$AQ$5=\"AP\",$AQ$5=\"AT\",$AQ$5=\"SP\"),INDEX(INDIRECT($AQ$7),$B18,AS$8)))","v":false},false,{"$f":"IF(OR($AQ$5=\"P\",$AQ$5=\"SS\",$AQ$5=\"S\"),INDEX(INDIRECT($AQ$6),$B18,AU$8),\nIF(OR($AQ$5=\"N\",$AQ$5=\"AP\",$AQ$5=\"AT\",$AQ$5=\"SP\"),INDEX(INDIRECT($AQ$7),$B18,AU$8)))","v":false},false,false,null,{"$f":"IF(OR($AY$5=\"P\",$AY$5=\"SS\",$AY$5=\"S\"),INDEX(INDIRECT($AY$6),$B18,AY$8),\nIF(OR($AY$5=\"N\",$AY$5=\"AP\",$AY$5=\"AT\",$AY$5=\"SP\"),INDEX(INDIRECT($AY$7),$B18,AY$8)))","v":false},{"$f":"IF(OR($AY$5=\"P\",$AY$5=\"SS\",$AY$5=\"S\"),INDEX(INDIRECT($AY$6),$B18,AZ$8),\nIF(OR($AY$5=\"N\",$AY$5=\"AP\",$AY$5=\"AT\",$AY$5=\"SP\"),INDEX(INDIRECT($AY$7),$B18,AZ$8)))","v":false},{"$f":"IF(OR($AY$5=\"P\",$AY$5=\"SS\",$AY$5=\"S\"),INDEX(INDIRECT($AY$6),$B18,BA$8),\nIF(OR($AY$5=\"N\",$AY$5=\"AP\",$AY$5=\"AT\",$AY$5=\"SP\"),INDEX(INDIRECT($AY$7),$B18,BA$8)))","v":false},false,{"$f":"IF(OR($AY$5=\"P\",$AY$5=\"SS\",$AY$5=\"S\"),INDEX(INDIRECT($AY$6),$B18,BC$8),\nIF(OR($AY$5=\"N\",$AY$5=\"AP\",$AY$5=\"AT\",$AY$5=\"SP\"),INDEX(INDIRECT($AY$7),$B18,BC$8)))","v":false},false,false,null,{"$f":"IF(OR($BG$5=\"P\",$BG$5=\"SS\",$BG$5=\"S\"),INDEX(INDIRECT($BG$6),$B18,BG$8),\nIF(OR($BG$5=\"N\",$BG$5=\"AP\",$BG$5=\"AT\",$BG$5=\"SP\"),INDEX(INDIRECT($BG$7),$B18,BG$8)))","v":false},{"$f":"IF(OR($BG$5=\"P\",$BG$5=\"SS\",$BG$5=\"S\"),INDEX(INDIRECT($BG$6),$B18,BH$8),\nIF(OR($BG$5=\"N\",$BG$5=\"AP\",$BG$5=\"AT\",$BG$5=\"SP\"),INDEX(INDIRECT($BG$7),$B18,BH$8)))","v":false},{"$f":"IF(OR($BG$5=\"P\",$BG$5=\"SS\",$BG$5=\"S\"),INDEX(INDIRECT($BG$6),$B18,BI$8),\nIF(OR($BG$5=\"N\",$BG$5=\"AP\",$BG$5=\"AT\",$BG$5=\"SP\"),INDEX(INDIRECT($BG$7),$B18,BI$8)))","v":false},false,{"$f":"IF(OR($BG$5=\"P\",$BG$5=\"SS\",$BG$5=\"S\"),INDEX(INDIRECT($BG$6),$B18,BK$8),\nIF(OR($BG$5=\"N\",$BG$5=\"AP\",$BG$5=\"AT\",$BG$5=\"SP\"),INDEX(INDIRECT($BG$7),$B18,BK$8)))","v":false},false,false,null,{"$f":"IF(OR($BO$5=\"P\",$BO$5=\"SS\",$BO$5=\"S\"),INDEX(INDIRECT($BO$6),$B18,BO$8),\nIF(OR($BO$5=\"N\",$BO$5=\"AP\",$BO$5=\"AT\",$BO$5=\"SP\"),INDEX(INDIRECT($BO$7),$B18,BO$8)))","v":false},{"$f":"IF(OR($BO$5=\"P\",$BO$5=\"SS\",$BO$5=\"S\"),INDEX(INDIRECT($BO$6),$B18,BP$8),\nIF(OR($BO$5=\"N\",$BO$5=\"AP\",$BO$5=\"AT\",$BO$5=\"SP\"),INDEX(INDIRECT($BO$7),$B18,BP$8)))","v":false},{"$f":"IF(OR($BO$5=\"P\",$BO$5=\"SS\",$BO$5=\"S\"),INDEX(INDIRECT($BO$6),$B18,BQ$8),\nIF(OR($BO$5=\"N\",$BO$5=\"AP\",$BO$5=\"AT\",$BO$5=\"SP\"),INDEX(INDIRECT($BO$7),$B18,BQ$8)))","v":false},false,{"$f":"IF(OR($BO$5=\"P\",$BO$5=\"SS\",$BO$5=\"S\"),INDEX(INDIRECT($BO$6),$B18,BS$8),\nIF(OR($BO$5=\"N\",$BO$5=\"AP\",$BO$5=\"AT\",$BO$5=\"SP\"),INDEX(INDIRECT($BO$7),$B18,BS$8)))","v":false},false,false,null,{"$f":"IF(OR($BW$5=\"P\",$BW$5=\"SS\",$BW$5=\"S\"),INDEX(INDIRECT($BW$6),$B18,BW$8),\nIF(OR($BW$5=\"N\",$BW$5=\"AP\",$BW$5=\"AT\",$BW$5=\"SP\"),INDEX(INDIRECT($BW$7),$B18,BW$8)))","v":false},{"$f":"IF(OR($BW$5=\"P\",$BW$5=\"SS\",$BW$5=\"S\"),INDEX(INDIRECT($BW$6),$B18,BX$8),\nIF(OR($BW$5=\"N\",$BW$5=\"AP\",$BW$5=\"AT\",$BW$5=\"SP\"),INDEX(INDIRECT($BW$7),$B18,BX$8)))","v":false},{"$f":"IF(OR($BW$5=\"P\",$BW$5=\"SS\",$BW$5=\"S\"),INDEX(INDIRECT($BW$6),$B18,BY$8),\nIF(OR($BW$5=\"N\",$BW$5=\"AP\",$BW$5=\"AT\",$BW$5=\"SP\"),INDEX(INDIRECT($BW$7),$B18,BY$8)))","v":false},false,{"$f":"IF(OR($BW$5=\"P\",$BW$5=\"SS\",$BW$5=\"S\"),INDEX(INDIRECT($BW$6),$B18,CA$8),\nIF(OR($BW$5=\"N\",$BW$5=\"AP\",$BW$5=\"AT\",$BW$5=\"SP\"),INDEX(INDIRECT($BW$7),$B18,CA$8)))","v":false},false,false,null,{"$f":"IF(OR($CE$5=\"P\",$CE$5=\"SS\",$CE$5=\"S\"),INDEX(INDIRECT($CE$6),$B18,CE$8),\nIF(OR($CE$5=\"N\",$CE$5=\"AP\",$CE$5=\"AT\",$CE$5=\"SP\"),INDEX(INDIRECT($CE$7),$B18,CE$8)))","v":false},{"$f":"IF(OR($CE$5=\"P\",$CE$5=\"SS\",$CE$5=\"S\"),INDEX(INDIRECT($CE$6),$B18,CF$8),\nIF(OR($CE$5=\"N\",$CE$5=\"AP\",$CE$5=\"AT\",$CE$5=\"SP\"),INDEX(INDIRECT($CE$7),$B18,CF$8)))","v":false},{"$f":"IF(OR($CE$5=\"P\",$CE$5=\"SS\",$CE$5=\"S\"),INDEX(INDIRECT($CE$6),$B18,CG$8),\nIF(OR($CE$5=\"N\",$CE$5=\"AP\",$CE$5=\"AT\",$CE$5=\"SP\"),INDEX(INDIRECT($CE$7),$B18,CG$8)))","v":false},false,{"$f":"IF(OR($CE$5=\"P\",$CE$5=\"SS\",$CE$5=\"S\"),INDEX(INDIRECT($CE$6),$B18,CI$8),\nIF(OR($CE$5=\"N\",$CE$5=\"AP\",$CE$5=\"AT\",$CE$5=\"SP\"),INDEX(INDIRECT($CE$7),$B18,CI$8)))","v":false},false,false,null,{"$f":"IF(OR($CM$5=\"P\",$CM$5=\"SS\",$CM$5=\"S\"),INDEX(INDIRECT($CM$6),$B18,CM$8),\nIF(OR($CM$5=\"N\",$CM$5=\"AP\",$CM$5=\"AT\",$CM$5=\"SP\"),INDEX(INDIRECT($CM$7),$B18,CM$8)))","v":false},{"$f":"IF(OR($CM$5=\"P\",$CM$5=\"SS\",$CM$5=\"S\"),INDEX(INDIRECT($CM$6),$B18,CN$8),\nIF(OR($CM$5=\"N\",$CM$5=\"AP\",$CM$5=\"AT\",$CM$5=\"SP\"),INDEX(INDIRECT($CM$7),$B18,CN$8)))","v":false},{"$f":"IF(OR($CM$5=\"P\",$CM$5=\"SS\",$CM$5=\"S\"),INDEX(INDIRECT($CM$6),$B18,CO$8),\nIF(OR($CM$5=\"N\",$CM$5=\"AP\",$CM$5=\"AT\",$CM$5=\"SP\"),INDEX(INDIRECT($CM$7),$B18,CO$8)))","v":false},false,{"$f":"IF(OR($CM$5=\"P\",$CM$5=\"SS\",$CM$5=\"S\"),INDEX(INDIRECT($CM$6),$B18,CQ$8),\nIF(OR($CM$5=\"N\",$CM$5=\"AP\",$CM$5=\"AT\",$CM$5=\"SP\"),INDEX(INDIRECT($CM$7),$B18,CQ$8)))","v":false},false,false,null,{"$f":"IF(OR($CU$5=\"P\",$CU$5=\"SS\",$CU$5=\"S\"),INDEX(INDIRECT($CU$6),$B18,CU$8),\nIF(OR($CU$5=\"N\",$CU$5=\"AP\",$CU$5=\"AT\",$CU$5=\"SP\"),INDEX(INDIRECT($CU$7),$B18,CU$8)))","v":false},{"$f":"IF(OR($CU$5=\"P\",$CU$5=\"SS\",$CU$5=\"S\"),INDEX(INDIRECT($CU$6),$B18,CV$8),\nIF(OR($CU$5=\"N\",$CU$5=\"AP\",$CU$5=\"AT\",$CU$5=\"SP\"),INDEX(INDIRECT($CU$7),$B18,CV$8)))","v":false},{"$f":"IF(OR($CU$5=\"P\",$CU$5=\"SS\",$CU$5=\"S\"),INDEX(INDIRECT($CU$6),$B18,CW$8),\nIF(OR($CU$5=\"N\",$CU$5=\"AP\",$CU$5=\"AT\",$CU$5=\"SP\"),INDEX(INDIRECT($CU$7),$B18,CW$8)))","v":false},false,{"$f":"IF(OR($CU$5=\"P\",$CU$5=\"SS\",$CU$5=\"S\"),INDEX(INDIRECT($CU$6),$B18,CY$8),\nIF(OR($CU$5=\"N\",$CU$5=\"AP\",$CU$5=\"AT\",$CU$5=\"SP\"),INDEX(INDIRECT($CU$7),$B18,CY$8)))","v":false},false,false,null,{"$f":"IF(OR($DC$5=\"P\",$DC$5=\"SS\",$DC$5=\"S\"),INDEX(INDIRECT($DC$6),$B18,DC$8),\nIF(OR($DC$5=\"N\",$DC$5=\"AP\",$DC$5=\"AT\",$DC$5=\"SP\"),INDEX(INDIRECT($DC$7),$B18,DC$8)))","v":false},{"$f":"IF(OR($DC$5=\"P\",$DC$5=\"SS\",$DC$5=\"S\"),INDEX(INDIRECT($DC$6),$B18,DD$8),\nIF(OR($DC$5=\"N\",$DC$5=\"AP\",$DC$5=\"AT\",$DC$5=\"SP\"),INDEX(INDIRECT($DC$7),$B18,DD$8)))","v":false},{"$f":"IF(OR($DC$5=\"P\",$DC$5=\"SS\",$DC$5=\"S\"),INDEX(INDIRECT($DC$6),$B18,DE$8),\nIF(OR($DC$5=\"N\",$DC$5=\"AP\",$DC$5=\"AT\",$DC$5=\"SP\"),INDEX(INDIRECT($DC$7),$B18,DE$8)))","v":false},false,{"$f":"IF(OR($DC$5=\"P\",$DC$5=\"SS\",$DC$5=\"S\"),INDEX(INDIRECT($DC$6),$B18,DG$8),\nIF(OR($DC$5=\"N\",$DC$5=\"AP\",$DC$5=\"AT\",$DC$5=\"SP\"),INDEX(INDIRECT($DC$7),$B18,DG$8)))","v":false},false,false,null,{"$f":"IF(OR($DK$5=\"P\",$DK$5=\"SS\",$DK$5=\"S\"),INDEX(INDIRECT($DK$6),$B18,DK$8),\nIF(OR($DK$5=\"N\",$DK$5=\"AP\",$DK$5=\"AT\",$DK$5=\"SP\"),INDEX(INDIRECT($DK$7),$B18,DK$8)))","v":false},{"$f":"IF(OR($DK$5=\"P\",$DK$5=\"SS\",$DK$5=\"S\"),INDEX(INDIRECT($DK$6),$B18,DL$8),\nIF(OR($DK$5=\"N\",$DK$5=\"AP\",$DK$5=\"AT\",$DK$5=\"SP\"),INDEX(INDIRECT($DK$7),$B18,DL$8)))","v":false},{"$f":"IF(OR($DK$5=\"P\",$DK$5=\"SS\",$DK$5=\"S\"),INDEX(INDIRECT($DK$6),$B18,DM$8),\nIF(OR($DK$5=\"N\",$DK$5=\"AP\",$DK$5=\"AT\",$DK$5=\"SP\"),INDEX(INDIRECT($DK$7),$B18,DM$8)))","v":false},false,{"$f":"IF(OR($DK$5=\"P\",$DK$5=\"SS\",$DK$5=\"S\"),INDEX(INDIRECT($DK$6),$B18,DO$8),\nIF(OR($DK$5=\"N\",$DK$5=\"AP\",$DK$5=\"AT\",$DK$5=\"SP\"),INDEX(INDIRECT($DK$7),$B18,DO$8)))","v":false},false,false,null,{"$f":"IF(OR($DS$5=\"P\",$DS$5=\"SS\",$DS$5=\"S\"),INDEX(INDIRECT($DS$6),$B18,DS$8),\nIF(OR($DS$5=\"N\",$DS$5=\"AP\",$DS$5=\"AT\",$DS$5=\"SP\"),INDEX(INDIRECT($DS$7),$B18,DS$8)))","v":false},{"$f":"IF(OR($DS$5=\"P\",$DS$5=\"SS\",$DS$5=\"S\"),INDEX(INDIRECT($DS$6),$B18,DT$8),\nIF(OR($DS$5=\"N\",$DS$5=\"AP\",$DS$5=\"AT\",$DS$5=\"SP\"),INDEX(INDIRECT($DS$7),$B18,DT$8)))","v":false},{"$f":"IF(OR($DS$5=\"P\",$DS$5=\"SS\",$DS$5=\"S\"),INDEX(INDIRECT($DS$6),$B18,DU$8),\nIF(OR($DS$5=\"N\",$DS$5=\"AP\",$DS$5=\"AT\",$DS$5=\"SP\"),INDEX(INDIRECT($DS$7),$B18,DU$8)))","v":false},false,{"$f":"IF(OR($DS$5=\"P\",$DS$5=\"SS\",$DS$5=\"S\"),INDEX(INDIRECT($DS$6),$B18,DW$8),\nIF(OR($DS$5=\"N\",$DS$5=\"AP\",$DS$5=\"AT\",$DS$5=\"SP\"),INDEX(INDIRECT($DS$7),$B18,DW$8)))","v":false},false,false,null,{"$f":"IF(OR($EA$5=\"P\",$EA$5=\"SS\",$EA$5=\"S\"),INDEX(INDIRECT($EA$6),$B18,EA$8),\nIF(OR($EA$5=\"N\",$EA$5=\"AP\",$EA$5=\"AT\",$EA$5=\"SP\"),INDEX(INDIRECT($EA$7),$B18,EA$8)))","v":false},{"$f":"IF(OR($EA$5=\"P\",$EA$5=\"SS\",$EA$5=\"S\"),INDEX(INDIRECT($EA$6),$B18,EB$8),\nIF(OR($EA$5=\"N\",$EA$5=\"AP\",$EA$5=\"AT\",$EA$5=\"SP\"),INDEX(INDIRECT($EA$7),$B18,EB$8)))","v":false},{"$f":"IF(OR($EA$5=\"P\",$EA$5=\"SS\",$EA$5=\"S\"),INDEX(INDIRECT($EA$6),$B18,EC$8),\nIF(OR($EA$5=\"N\",$EA$5=\"AP\",$EA$5=\"AT\",$EA$5=\"SP\"),INDEX(INDIRECT($EA$7),$B18,EC$8)))","v":false},false,{"$f":"IF(OR($EA$5=\"P\",$EA$5=\"SS\",$EA$5=\"S\"),INDEX(INDIRECT($EA$6),$B18,EE$8),\nIF(OR($EA$5=\"N\",$EA$5=\"AP\",$EA$5=\"AT\",$EA$5=\"SP\"),INDEX(INDIRECT($EA$7),$B18,EE$8)))","v":false},false,false,null,{"$f":"IF(OR($EI$5=\"P\",$EI$5=\"SS\",$EI$5=\"S\"),INDEX(INDIRECT($EI$6),$B18,EI$8),\nIF(OR($EI$5=\"N\",$EI$5=\"AP\",$EI$5=\"AT\",$EI$5=\"SP\"),INDEX(INDIRECT($EI$7),$B18,EI$8)))","v":false},{"$f":"IF(OR($EI$5=\"P\",$EI$5=\"SS\",$EI$5=\"S\"),INDEX(INDIRECT($EI$6),$B18,EJ$8),\nIF(OR($EI$5=\"N\",$EI$5=\"AP\",$EI$5=\"AT\",$EI$5=\"SP\"),INDEX(INDIRECT($EI$7),$B18,EJ$8)))","v":false},{"$f":"IF(OR($EI$5=\"P\",$EI$5=\"SS\",$EI$5=\"S\"),INDEX(INDIRECT($EI$6),$B18,EK$8),\nIF(OR($EI$5=\"N\",$EI$5=\"AP\",$EI$5=\"AT\",$EI$5=\"SP\"),INDEX(INDIRECT($EI$7),$B18,EK$8)))","v":false},false,{"$f":"IF(OR($EI$5=\"P\",$EI$5=\"SS\",$EI$5=\"S\"),INDEX(INDIRECT($EI$6),$B18,EM$8),\nIF(OR($EI$5=\"N\",$EI$5=\"AP\",$EI$5=\"AT\",$EI$5=\"SP\"),INDEX(INDIRECT($EI$7),$B18,EM$8)))","v":false},false,false,null,{"$f":"IF(OR($EQ$5=\"P\",$EQ$5=\"SS\",$EQ$5=\"S\"),INDEX(INDIRECT($EQ$6),$B18,EQ$8),\nIF(OR($EQ$5=\"N\",$EQ$5=\"AP\",$EQ$5=\"AT\",$EQ$5=\"SP\"),INDEX(INDIRECT($EQ$7),$B18,EQ$8)))","v":false},{"$f":"IF(OR($EQ$5=\"P\",$EQ$5=\"SS\",$EQ$5=\"S\"),INDEX(INDIRECT($EQ$6),$B18,ER$8),\nIF(OR($EQ$5=\"N\",$EQ$5=\"AP\",$EQ$5=\"AT\",$EQ$5=\"SP\"),INDEX(INDIRECT($EQ$7),$B18,ER$8)))","v":false},{"$f":"IF(OR($EQ$5=\"P\",$EQ$5=\"SS\",$EQ$5=\"S\"),INDEX(INDIRECT($EQ$6),$B18,ES$8),\nIF(OR($EQ$5=\"N\",$EQ$5=\"AP\",$EQ$5=\"AT\",$EQ$5=\"SP\"),INDEX(INDIRECT($EQ$7),$B18,ES$8)))","v":false},false,{"$f":"IF(OR($EQ$5=\"P\",$EQ$5=\"SS\",$EQ$5=\"S\"),INDEX(INDIRECT($EQ$6),$B18,EU$8),\nIF(OR($EQ$5=\"N\",$EQ$5=\"AP\",$EQ$5=\"AT\",$EQ$5=\"SP\"),INDEX(INDIRECT($EQ$7),$B18,EU$8)))","v":false},false,false,null,{"$f":"IF(OR($EY$5=\"P\",$EY$5=\"SS\",$EY$5=\"S\"),INDEX(INDIRECT($EY$6),$B18,EY$8),\nIF(OR($EY$5=\"N\",$EY$5=\"AP\",$EY$5=\"AT\",$EY$5=\"SP\"),INDEX(INDIRECT($EY$7),$B18,EY$8)))","v":false},{"$f":"IF(OR($EY$5=\"P\",$EY$5=\"SS\",$EY$5=\"S\"),INDEX(INDIRECT($EY$6),$B18,EZ$8),\nIF(OR($EY$5=\"N\",$EY$5=\"AP\",$EY$5=\"AT\",$EY$5=\"SP\"),INDEX(INDIRECT($EY$7),$B18,EZ$8)))","v":false},{"$f":"IF(OR($EY$5=\"P\",$EY$5=\"SS\",$EY$5=\"S\"),INDEX(INDIRECT($EY$6),$B18,FA$8),\nIF(OR($EY$5=\"N\",$EY$5=\"AP\",$EY$5=\"AT\",$EY$5=\"SP\"),INDEX(INDIRECT($EY$7),$B18,FA$8)))","v":false},false,{"$f":"IF(OR($EY$5=\"P\",$EY$5=\"SS\",$EY$5=\"S\"),INDEX(INDIRECT($EY$6),$B18,FC$8),\nIF(OR($EY$5=\"N\",$EY$5=\"AP\",$EY$5=\"AT\",$EY$5=\"SP\"),INDEX(INDIRECT($EY$7),$B18,FC$8)))","v":false},false,false]
["Pupil to adult ratio",11,{"$f":"IF(OR($C$5=\"P\",$C$5=\"SS\",$C$5=\"S\"),INDEX(INDIRECT($C$6),$B19,C$8),\nIF(OR($C$5=\"N\",$C$5=\"AP\",$C$5=\"AT\",$C$5=\"SP\"),INDEX(INDIRECT($C$7),$B19,C$8)))","v":8.5},{"$f":"IF(OR($C$5=\"P\",$C$5=\"SS\",$C$5=\"S\"),INDEX(INDIRECT($C$6),$B19,D$8),\nIF(OR($C$5=\"N\",$C$5=\"AP\",$C$5=\"AT\",$C$5=\"SP\"),INDEX(INDIRECT($C$7),$B19,D$8)))","v":{"v":9,"d":"9.0"}},{"$f":"IF(OR($C$5=\"P\",$C$5=\"SS\",$C$5=\"S\"),INDEX(INDIRECT($C$6),$B19,E$8),\nIF(OR($C$5=\"N\",$C$5=\"AP\",$C$5=\"AT\",$C$5=\"SP\"),INDEX(INDIRECT($C$7),$B19,E$8)))","v":9.5},{"v":10,"d":"10.0"},{"$f":"IF(OR($C$5=\"P\",$C$5=\"SS\",$C$5=\"S\"),INDEX(INDIRECT($C$6),$B19,G$8),\nIF(OR($C$5=\"N\",$C$5=\"AP\",$C$5=\"AT\",$C$5=\"SP\"),INDEX(INDIRECT($C$7),$B19,G$8)))","v":{"v":10,"d":"10.0"}},{"v":11,"d":"11.0"},11.5,null,{"$f":"IF(OR($K$5=\"P\",$K$5=\"SS\",$K$5=\"S\"),INDEX(INDIRECT($K$6),$B19,K$8),\nIF(OR($K$5=\"N\",$K$5=\"AP\",$K$5=\"AT\",$K$5=\"SP\"),INDEX(INDIRECT($K$7),$B19,K$8)))","v":false},{"$f":"IF(OR($K$5=\"P\",$K$5=\"SS\",$K$5=\"S\"),INDEX(INDIRECT($K$6),$B19,L$8),\nIF(OR($K$5=\"N\",$K$5=\"AP\",$K$5=\"AT\",$K$5=\"SP\"),INDEX(INDIRECT($K$7),$B19,L$8)))","v":false},{"$f":"IF(OR($K$5=\"P\",$K$5=\"SS\",$K$5=\"S\"),INDEX(INDIRECT($K$6),$B19,M$8),\nIF(OR($K$5=\"N\",$K$5=\"AP\",$K$5=\"AT\",$K$5=\"SP\"),INDEX(INDIRECT($K$7),$B19,M$8)))","v":false},false,{"$f":"IF(OR($K$5=\"P\",$K$5=\"SS\",$K$5=\"S\"),INDEX(INDIRECT($K$6),$B19,O$8),\nIF(OR($K$5=\"N\",$K$5=\"AP\",$K$5=\"AT\",$K$5=\"SP\"),INDEX(INDIRECT($K$7),$B19,O$8)))","v":false},false,false,null,{"$f":"IF(OR($S$5=\"P\",$S$5=\"SS\",$S$5=\"S\"),INDEX(INDIRECT($S$6),$B19,S$8),\nIF(OR($S$5=\"N\",$S$5=\"AP\",$S$5=\"AT\",$S$5=\"SP\"),INDEX(INDIRECT($S$7),$B19,S$8)))","v":false},{"$f":"IF(OR($S$5=\"P\",$S$5=\"SS\",$S$5=\"S\"),INDEX(INDIRECT($S$6),$B19,T$8),\nIF(OR($S$5=\"N\",$S$5=\"AP\",$S$5=\"AT\",$S$5=\"SP\"),INDEX(INDIRECT($S$7),$B19,T$8)))","v":false},{"$f":"IF(OR($S$5=\"P\",$S$5=\"SS\",$S$5=\"S\"),INDEX(INDIRECT($S$6),$B19,U$8),\nIF(OR($S$5=\"N\",$S$5=\"AP\",$S$5=\"AT\",$S$5=\"SP\"),INDEX(INDIRECT($S$7),$B19,U$8)))","v":false},false,{"$f":"IF(OR($S$5=\"P\",$S$5=\"SS\",$S$5=\"S\"),INDEX(INDIRECT($S$6),$B19,W$8),\nIF(OR($S$5=\"N\",$S$5=\"AP\",$S$5=\"AT\",$S$5=\"SP\"),INDEX(INDIRECT($S$7),$B19,W$8)))","v":false},false,false,null,{"$f":"IF(OR($AA$5=\"P\",$AA$5=\"SS\",$AA$5=\"S\"),INDEX(INDIRECT($AA$6),$B19,AA$8),\nIF(OR($AA$5=\"N\",$AA$5=\"AP\",$AA$5=\"AT\",$AA$5=\"SP\"),INDEX(INDIRECT($AA$7),$B19,AA$8)))","v":false},{"$f":"IF(OR($AA$5=\"P\",$AA$5=\"SS\",$AA$5=\"S\"),INDEX(INDIRECT($AA$6),$B19,AB$8),\nIF(OR($AA$5=\"N\",$AA$5=\"AP\",$AA$5=\"AT\",$AA$5=\"SP\"),INDEX(INDIRECT($AA$7),$B19,AB$8)))","v":false},{"$f":"IF(OR($AA$5=\"P\",$AA$5=\"SS\",$AA$5=\"S\"),INDEX(INDIRECT($AA$6),$B19,AC$8),\nIF(OR($AA$5=\"N\",$AA$5=\"AP\",$AA$5=\"AT\",$AA$5=\"SP\"),INDEX(INDIRECT($AA$7),$B19,AC$8)))","v":false},false,{"$f":"IF(OR($AA$5=\"P\",$AA$5=\"SS\",$AA$5=\"S\"),INDEX(INDIRECT($AA$6),$B19,AE$8),\nIF(OR($AA$5=\"N\",$AA$5=\"AP\",$AA$5=\"AT\",$AA$5=\"SP\"),INDEX(INDIRECT($AA$7),$B19,AE$8)))","v":false},false,false,null,{"$f":"IF(OR($AI$5=\"P\",$AI$5=\"SS\",$AI$5=\"S\"),INDEX(INDIRECT($AI$6),$B19,AI$8),\nIF(OR($AI$5=\"N\",$AI$5=\"AP\",$AI$5=\"AT\",$AI$5=\"SP\"),INDEX(INDIRECT($AI$7),$B19,AI$8)))","v":false},{"$f":"IF(OR($AI$5=\"P\",$AI$5=\"SS\",$AI$5=\"S\"),INDEX(INDIRECT($AI$6),$B19,AJ$8),\nIF(OR($AI$5=\"N\",$AI$5=\"AP\",$AI$5=\"AT\",$AI$5=\"SP\"),INDEX(INDIRECT($AI$7),$B19,AJ$8)))","v":false},{"$f":"IF(OR($AI$5=\"P\",$AI$5=\"SS\",$AI$5=\"S\"),INDEX(INDIRECT($AI$6),$B19,AK$8),\nIF(OR($AI$5=\"N\",$AI$5=\"AP\",$AI$5=\"AT\",$AI$5=\"SP\"),INDEX(INDIRECT($AI$7),$B19,AK$8)))","v":false},false,{"$f":"IF(OR($AI$5=\"P\",$AI$5=\"SS\",$AI$5=\"S\"),INDEX(INDIRECT($AI$6),$B19,AM$8),\nIF(OR($AI$5=\"N\",$AI$5=\"AP\",$AI$5=\"AT\",$AI$5=\"SP\"),INDEX(INDIRECT($AI$7),$B19,AM$8)))","v":false},false,false,null,{"$f":"IF(OR($AQ$5=\"P\",$AQ$5=\"SS\",$AQ$5=\"S\"),INDEX(INDIRECT($AQ$6),$B19,AQ$8),\nIF(OR($AQ$5=\"N\",$AQ$5=\"AP\",$AQ$5=\"AT\",$AQ$5=\"SP\"),INDEX(INDIRECT($AQ$7),$B19,AQ$8)))","v":false},{"$f":"IF(OR($AQ$5=\"P\",$AQ$5=\"SS\",$AQ$5=\"S\"),INDEX(INDIRECT($AQ$6),$B19,AR$8),\nIF(OR($AQ$5=\"N\",$AQ$5=\"AP\",$AQ$5=\"AT\",$AQ$5=\"SP\"),INDEX(INDIRECT($AQ$7),$B19,AR$8)))","v":false},{"$f":"IF(OR($AQ$5=\"P\",$AQ$5=\"SS\",$AQ$5=\"S\"),INDEX(INDIRECT($AQ$6),$B19,AS$8),\nIF(OR($AQ$5=\"N\",$AQ$5=\"AP\",$AQ$5=\"AT\",$AQ$5=\"SP\"),INDEX(INDIRECT($AQ$7),$B19,AS$8)))","v":false},false,{"$f":"IF(OR($AQ$5=\"P\",$AQ$5=\"SS\",$AQ$5=\"S\"),INDEX(INDIRECT($AQ$6),$B19,AU$8),\nIF(OR($AQ$5=\"N\",$AQ$5=\"AP\",$AQ$5=\"AT\",$AQ$5=\"SP\"),INDEX(INDIRECT($AQ$7),$B19,AU$8)))","v":false},false,false,null,{"$f":"IF(OR($AY$5=\"P\",$AY$5=\"SS\",$AY$5=\"S\"),INDEX(INDIRECT($AY$6),$B19,AY$8),\nIF(OR($AY$5=\"N\",$AY$5=\"AP\",$AY$5=\"AT\",$AY$5=\"SP\"),INDEX(INDIRECT($AY$7),$B19,AY$8)))","v":false},{"$f":"IF(OR($AY$5=\"P\",$AY$5=\"SS\",$AY$5=\"S\"),INDEX(INDIRECT($AY$6),$B19,AZ$8),\nIF(OR($AY$5=\"N\",$AY$5=\"AP\",$AY$5=\"AT\",$AY$5=\"SP\"),INDEX(INDIRECT($AY$7),$B19,AZ$8)))","v":false},{"$f":"IF(OR($AY$5=\"P\",$AY$5=\"SS\",$AY$5=\"S\"),INDEX(INDIRECT($AY$6),$B19,BA$8),\nIF(OR($AY$5=\"N\",$AY$5=\"AP\",$AY$5=\"AT\",$AY$5=\"SP\"),INDEX(INDIRECT($AY$7),$B19,BA$8)))","v":false},false,{"$f":"IF(OR($AY$5=\"P\",$AY$5=\"SS\",$AY$5=\"S\"),INDEX(INDIRECT($AY$6),$B19,BC$8),\nIF(OR($AY$5=\"N\",$AY$5=\"AP\",$AY$5=\"AT\",$AY$5=\"SP\"),INDEX(INDIRECT($AY$7),$B19,BC$8)))","v":false},false,false,null,{"$f":"IF(OR($BG$5=\"P\",$BG$5=\"SS\",$BG$5=\"S\"),INDEX(INDIRECT($BG$6),$B19,BG$8),\nIF(OR($BG$5=\"N\",$BG$5=\"AP\",$BG$5=\"AT\",$BG$5=\"SP\"),INDEX(INDIRECT($BG$7),$B19,BG$8)))","v":false},{"$f":"IF(OR($BG$5=\"P\",$BG$5=\"SS\",$BG$5=\"S\"),INDEX(INDIRECT($BG$6),$B19,BH$8),\nIF(OR($BG$5=\"N\",$BG$5=\"AP\",$BG$5=\"AT\",$BG$5=\"SP\"),INDEX(INDIRECT($BG$7),$B19,BH$8)))","v":false},{"$f":"IF(OR($BG$5=\"P\",$BG$5=\"SS\",$BG$5=\"S\"),INDEX(INDIRECT($BG$6),$B19,BI$8),\nIF(OR($BG$5=\"N\",$BG$5=\"AP\",$BG$5=\"AT\",$BG$5=\"SP\"),INDEX(INDIRECT($BG$7),$B19,BI$8)))","v":false},false,{"$f":"IF(OR($BG$5=\"P\",$BG$5=\"SS\",$BG$5=\"S\"),INDEX(INDIRECT($BG$6),$B19,BK$8),\nIF(OR($BG$5=\"N\",$BG$5=\"AP\",$BG$5=\"AT\",$BG$5=\"SP\"),INDEX(INDIRECT($BG$7),$B19,BK$8)))","v":false},false,false,null,{"$f":"IF(OR($BO$5=\"P\",$BO$5=\"SS\",$BO$5=\"S\"),INDEX(INDIRECT($BO$6),$B19,BO$8),\nIF(OR($BO$5=\"N\",$BO$5=\"AP\",$BO$5=\"AT\",$BO$5=\"SP\"),INDEX(INDIRECT($BO$7),$B19,BO$8)))","v":false},{"$f":"IF(OR($BO$5=\"P\",$BO$5=\"SS\",$BO$5=\"S\"),INDEX(INDIRECT($BO$6),$B19,BP$8),\nIF(OR($BO$5=\"N\",$BO$5=\"AP\",$BO$5=\"AT\",$BO$5=\"SP\"),INDEX(INDIRECT($BO$7),$B19,BP$8)))","v":false},{"$f":"IF(OR($BO$5=\"P\",$BO$5=\"SS\",$BO$5=\"S\"),INDEX(INDIRECT($BO$6),$B19,BQ$8),\nIF(OR($BO$5=\"N\",$BO$5=\"AP\",$BO$5=\"AT\",$BO$5=\"SP\"),INDEX(INDIRECT($BO$7),$B19,BQ$8)))","v":false},false,{"$f":"IF(OR($BO$5=\"P\",$BO$5=\"SS\",$BO$5=\"S\"),INDEX(INDIRECT($BO$6),$B19,BS$8),\nIF(OR($BO$5=\"N\",$BO$5=\"AP\",$BO$5=\"AT\",$BO$5=\"SP\"),INDEX(INDIRECT($BO$7),$B19,BS$8)))","v":false},false,false,null,{"$f":"IF(OR($BW$5=\"P\",$BW$5=\"SS\",$BW$5=\"S\"),INDEX(INDIRECT($BW$6),$B19,BW$8),\nIF(OR($BW$5=\"N\",$BW$5=\"AP\",$BW$5=\"AT\",$BW$5=\"SP\"),INDEX(INDIRECT($BW$7),$B19,BW$8)))","v":false},{"$f":"IF(OR($BW$5=\"P\",$BW$5=\"SS\",$BW$5=\"S\"),INDEX(INDIRECT($BW$6),$B19,BX$8),\nIF(OR($BW$5=\"N\",$BW$5=\"AP\",$BW$5=\"AT\",$BW$5=\"SP\"),INDEX(INDIRECT($BW$7),$B19,BX$8)))","v":false},{"$f":"IF(OR($BW$5=\"P\",$BW$5=\"SS\",$BW$5=\"S\"),INDEX(INDIRECT($BW$6),$B19,BY$8),\nIF(OR($BW$5=\"N\",$BW$5=\"AP\",$BW$5=\"AT\",$BW$5=\"SP\"),INDEX(INDIRECT($BW$7),$B19,BY$8)))","v":false},false,{"$f":"IF(OR($BW$5=\"P\",$BW$5=\"SS\",$BW$5=\"S\"),INDEX(INDIRECT($BW$6),$B19,CA$8),\nIF(OR($BW$5=\"N\",$BW$5=\"AP\",$BW$5=\"AT\",$BW$5=\"SP\"),INDEX(INDIRECT($BW$7),$B19,CA$8)))","v":false},false,false,null,{"$f":"IF(OR($CE$5=\"P\",$CE$5=\"SS\",$CE$5=\"S\"),INDEX(INDIRECT($CE$6),$B19,CE$8),\nIF(OR($CE$5=\"N\",$CE$5=\"AP\",$CE$5=\"AT\",$CE$5=\"SP\"),INDEX(INDIRECT($CE$7),$B19,CE$8)))","v":false},{"$f":"IF(OR($CE$5=\"P\",$CE$5=\"SS\",$CE$5=\"S\"),INDEX(INDIRECT($CE$6),$B19,CF$8),\nIF(OR($CE$5=\"N\",$CE$5=\"AP\",$CE$5=\"AT\",$CE$5=\"SP\"),INDEX(INDIRECT($CE$7),$B19,CF$8)))","v":false},{"$f":"IF(OR($CE$5=\"P\",$CE$5=\"SS\",$CE$5=\"S\"),INDEX(INDIRECT($CE$6),$B19,CG$8),\nIF(OR($CE$5=\"N\",$CE$5=\"AP\",$CE$5=\"AT\",$CE$5=\"SP\"),INDEX(INDIRECT($CE$7),$B19,CG$8)))","v":false},false,{"$f":"IF(OR($CE$5=\"P\",$CE$5=\"SS\",$CE$5=\"S\"),INDEX(INDIRECT($CE$6),$B19,CI$8),\nIF(OR($CE$5=\"N\",$CE$5=\"AP\",$CE$5=\"AT\",$CE$5=\"SP\"),INDEX(INDIRECT($CE$7),$B19,CI$8)))","v":false},false,false,null,{"$f":"IF(OR($CM$5=\"P\",$CM$5=\"SS\",$CM$5=\"S\"),INDEX(INDIRECT($CM$6),$B19,CM$8),\nIF(OR($CM$5=\"N\",$CM$5=\"AP\",$CM$5=\"AT\",$CM$5=\"SP\"),INDEX(INDIRECT($CM$7),$B19,CM$8)))","v":false},{"$f":"IF(OR($CM$5=\"P\",$CM$5=\"SS\",$CM$5=\"S\"),INDEX(INDIRECT($CM$6),$B19,CN$8),\nIF(OR($CM$5=\"N\",$CM$5=\"AP\",$CM$5=\"AT\",$CM$5=\"SP\"),INDEX(INDIRECT($CM$7),$B19,CN$8)))","v":false},{"$f":"IF(OR($CM$5=\"P\",$CM$5=\"SS\",$CM$5=\"S\"),INDEX(INDIRECT($CM$6),$B19,CO$8),\nIF(OR($CM$5=\"N\",$CM$5=\"AP\",$CM$5=\"AT\",$CM$5=\"SP\"),INDEX(INDIRECT($CM$7),$B19,CO$8)))","v":false},false,{"$f":"IF(OR($CM$5=\"P\",$CM$5=\"SS\",$CM$5=\"S\"),INDEX(INDIRECT($CM$6),$B19,CQ$8),\nIF(OR($CM$5=\"N\",$CM$5=\"AP\",$CM$5=\"AT\",$CM$5=\"SP\"),INDEX(INDIRECT($CM$7),$B19,CQ$8)))","v":false},false,false,null,{"$f":"IF(OR($CU$5=\"P\",$CU$5=\"SS\",$CU$5=\"S\"),INDEX(INDIRECT($CU$6),$B19,CU$8),\nIF(OR($CU$5=\"N\",$CU$5=\"AP\",$CU$5=\"AT\",$CU$5=\"SP\"),INDEX(INDIRECT($CU$7),$B19,CU$8)))","v":false},{"$f":"IF(OR($CU$5=\"P\",$CU$5=\"SS\",$CU$5=\"S\"),INDEX(INDIRECT($CU$6),$B19,CV$8),\nIF(OR($CU$5=\"N\",$CU$5=\"AP\",$CU$5=\"AT\",$CU$5=\"SP\"),INDEX(INDIRECT($CU$7),$B19,CV$8)))","v":false},{"$f":"IF(OR($CU$5=\"P\",$CU$5=\"SS\",$CU$5=\"S\"),INDEX(INDIRECT($CU$6),$B19,CW$8),\nIF(OR($CU$5=\"N\",$CU$5=\"AP\",$CU$5=\"AT\",$CU$5=\"SP\"),INDEX(INDIRECT($CU$7),$B19,CW$8)))","v":false},false,{"$f":"IF(OR($CU$5=\"P\",$CU$5=\"SS\",$CU$5=\"S\"),INDEX(INDIRECT($CU$6),$B19,CY$8),\nIF(OR($CU$5=\"N\",$CU$5=\"AP\",$CU$5=\"AT\",$CU$5=\"SP\"),INDEX(INDIRECT($CU$7),$B19,CY$8)))","v":false},false,false,null,{"$f":"IF(OR($DC$5=\"P\",$DC$5=\"SS\",$DC$5=\"S\"),INDEX(INDIRECT($DC$6),$B19,DC$8),\nIF(OR($DC$5=\"N\",$DC$5=\"AP\",$DC$5=\"AT\",$DC$5=\"SP\"),INDEX(INDIRECT($DC$7),$B19,DC$8)))","v":false},{"$f":"IF(OR($DC$5=\"P\",$DC$5=\"SS\",$DC$5=\"S\"),INDEX(INDIRECT($DC$6),$B19,DD$8),\nIF(OR($DC$5=\"N\",$DC$5=\"AP\",$DC$5=\"AT\",$DC$5=\"SP\"),INDEX(INDIRECT($DC$7),$B19,DD$8)))","v":false},{"$f":"IF(OR($DC$5=\"P\",$DC$5=\"SS\",$DC$5=\"S\"),INDEX(INDIRECT($DC$6),$B19,DE$8),\nIF(OR($DC$5=\"N\",$DC$5=\"AP\",$DC$5=\"AT\",$DC$5=\"SP\"),INDEX(INDIRECT($DC$7),$B19,DE$8)))","v":false},false,{"$f":"IF(OR($DC$5=\"P\",$DC$5=\"SS\",$DC$5=\"S\"),INDEX(INDIRECT($DC$6),$B19,DG$8),\nIF(OR($DC$5=\"N\",$DC$5=\"AP\",$DC$5=\"AT\",$DC$5=\"SP\"),INDEX(INDIRECT($DC$7),$B19,DG$8)))","v":false},false,false,null,{"$f":"IF(OR($DK$5=\"P\",$DK$5=\"SS\",$DK$5=\"S\"),INDEX(INDIRECT($DK$6),$B19,DK$8),\nIF(OR($DK$5=\"N\",$DK$5=\"AP\",$DK$5=\"AT\",$DK$5=\"SP\"),INDEX(INDIRECT($DK$7),$B19,DK$8)))","v":false},{"$f":"IF(OR($DK$5=\"P\",$DK$5=\"SS\",$DK$5=\"S\"),INDEX(INDIRECT($DK$6),$B19,DL$8),\nIF(OR($DK$5=\"N\",$DK$5=\"AP\",$DK$5=\"AT\",$DK$5=\"SP\"),INDEX(INDIRECT($DK$7),$B19,DL$8)))","v":false},{"$f":"IF(OR($DK$5=\"P\",$DK$5=\"SS\",$DK$5=\"S\"),INDEX(INDIRECT($DK$6),$B19,DM$8),\nIF(OR($DK$5=\"N\",$DK$5=\"AP\",$DK$5=\"AT\",$DK$5=\"SP\"),INDEX(INDIRECT($DK$7),$B19,DM$8)))","v":false},false,{"$f":"IF(OR($DK$5=\"P\",$DK$5=\"SS\",$DK$5=\"S\"),INDEX(INDIRECT($DK$6),$B19,DO$8),\nIF(OR($DK$5=\"N\",$DK$5=\"AP\",$DK$5=\"AT\",$DK$5=\"SP\"),INDEX(INDIRECT($DK$7),$B19,DO$8)))","v":false},false,false,null,{"$f":"IF(OR($DS$5=\"P\",$DS$5=\"SS\",$DS$5=\"S\"),INDEX(INDIRECT($DS$6),$B19,DS$8),\nIF(OR($DS$5=\"N\",$DS$5=\"AP\",$DS$5=\"AT\",$DS$5=\"SP\"),INDEX(INDIRECT($DS$7),$B19,DS$8)))","v":false},{"$f":"IF(OR($DS$5=\"P\",$DS$5=\"SS\",$DS$5=\"S\"),INDEX(INDIRECT($DS$6),$B19,DT$8),\nIF(OR($DS$5=\"N\",$DS$5=\"AP\",$DS$5=\"AT\",$DS$5=\"SP\"),INDEX(INDIRECT($DS$7),$B19,DT$8)))","v":false},{"$f":"IF(OR($DS$5=\"P\",$DS$5=\"SS\",$DS$5=\"S\"),INDEX(INDIRECT($DS$6),$B19,DU$8),\nIF(OR($DS$5=\"N\",$DS$5=\"AP\",$DS$5=\"AT\",$DS$5=\"SP\"),INDEX(INDIRECT($DS$7),$B19,DU$8)))","v":false},false,{"$f":"IF(OR($DS$5=\"P\",$DS$5=\"SS\",$DS$5=\"S\"),INDEX(INDIRECT($DS$6),$B19,DW$8),\nIF(OR($DS$5=\"N\",$DS$5=\"AP\",$DS$5=\"AT\",$DS$5=\"SP\"),INDEX(INDIRECT($DS$7),$B19,DW$8)))","v":false},false,false,null,{"$f":"IF(OR($EA$5=\"P\",$EA$5=\"SS\",$EA$5=\"S\"),INDEX(INDIRECT($EA$6),$B19,EA$8),\nIF(OR($EA$5=\"N\",$EA$5=\"AP\",$EA$5=\"AT\",$EA$5=\"SP\"),INDEX(INDIRECT($EA$7),$B19,EA$8)))","v":false},{"$f":"IF(OR($EA$5=\"P\",$EA$5=\"SS\",$EA$5=\"S\"),INDEX(INDIRECT($EA$6),$B19,EB$8),\nIF(OR($EA$5=\"N\",$EA$5=\"AP\",$EA$5=\"AT\",$EA$5=\"SP\"),INDEX(INDIRECT($EA$7),$B19,EB$8)))","v":false},{"$f":"IF(OR($EA$5=\"P\",$EA$5=\"SS\",$EA$5=\"S\"),INDEX(INDIRECT($EA$6),$B19,EC$8),\nIF(OR($EA$5=\"N\",$EA$5=\"AP\",$EA$5=\"AT\",$EA$5=\"SP\"),INDEX(INDIRECT($EA$7),$B19,EC$8)))","v":false},false,{"$f":"IF(OR($EA$5=\"P\",$EA$5=\"SS\",$EA$5=\"S\"),INDEX(INDIRECT($EA$6),$B19,EE$8),\nIF(OR($EA$5=\"N\",$EA$5=\"AP\",$EA$5=\"AT\",$EA$5=\"SP\"),INDEX(INDIRECT($EA$7),$B19,EE$8)))","v":false},false,false,null,{"$f":"IF(OR($EI$5=\"P\",$EI$5=\"SS\",$EI$5=\"S\"),INDEX(INDIRECT($EI$6),$B19,EI$8),\nIF(OR($EI$5=\"N\",$EI$5=\"AP\",$EI$5=\"AT\",$EI$5=\"SP\"),INDEX(INDIRECT($EI$7),$B19,EI$8)))","v":false},{"$f":"IF(OR($EI$5=\"P\",$EI$5=\"SS\",$EI$5=\"S\"),INDEX(INDIRECT($EI$6),$B19,EJ$8),\nIF(OR($EI$5=\"N\",$EI$5=\"AP\",$EI$5=\"AT\",$EI$5=\"SP\"),INDEX(INDIRECT($EI$7),$B19,EJ$8)))","v":false},{"$f":"IF(OR($EI$5=\"P\",$EI$5=\"SS\",$EI$5=\"S\"),INDEX(INDIRECT($EI$6),$B19,EK$8),\nIF(OR($EI$5=\"N\",$EI$5=\"AP\",$EI$5=\"AT\",$EI$5=\"SP\"),INDEX(INDIRECT($EI$7),$B19,EK$8)))","v":false},false,{"$f":"IF(OR($EI$5=\"P\",$EI$5=\"SS\",$EI$5=\"S\"),INDEX(INDIRECT($EI$6),$B19,EM$8),\nIF(OR($EI$5=\"N\",$EI$5=\"AP\",$EI$5=\"AT\",$EI$5=\"SP\"),INDEX(INDIRECT($EI$7),$B19,EM$8)))","v":false},false,false,null,{"$f":"IF(OR($EQ$5=\"P\",$EQ$5=\"SS\",$EQ$5=\"S\"),INDEX(INDIRECT($EQ$6),$B19,EQ$8),\nIF(OR($EQ$5=\"N\",$EQ$5=\"AP\",$EQ$5=\"AT\",$EQ$5=\"SP\"),INDEX(INDIRECT($EQ$7),$B19,EQ$8)))","v":false},{"$f":"IF(OR($EQ$5=\"P\",$EQ$5=\"SS\",$EQ$5=\"S\"),INDEX(INDIRECT($EQ$6),$B19,ER$8),\nIF(OR($EQ$5=\"N\",$EQ$5=\"AP\",$EQ$5=\"AT\",$EQ$5=\"SP\"),INDEX(INDIRECT($EQ$7),$B19,ER$8)))","v":false},{"$f":"IF(OR($EQ$5=\"P\",$EQ$5=\"SS\",$EQ$5=\"S\"),INDEX(INDIRECT($EQ$6),$B19,ES$8),\nIF(OR($EQ$5=\"N\",$EQ$5=\"AP\",$EQ$5=\"AT\",$EQ$5=\"SP\"),INDEX(INDIRECT($EQ$7),$B19,ES$8)))","v":false},false,{"$f":"IF(OR($EQ$5=\"P\",$EQ$5=\"SS\",$EQ$5=\"S\"),INDEX(INDIRECT($EQ$6),$B19,EU$8),\nIF(OR($EQ$5=\"N\",$EQ$5=\"AP\",$EQ$5=\"AT\",$EQ$5=\"SP\"),INDEX(INDIRECT($EQ$7),$B19,EU$8)))","v":false},false,false,null,{"$f":"IF(OR($EY$5=\"P\",$EY$5=\"SS\",$EY$5=\"S\"),INDEX(INDIRECT($EY$6),$B19,EY$8),\nIF(OR($EY$5=\"N\",$EY$5=\"AP\",$EY$5=\"AT\",$EY$5=\"SP\"),INDEX(INDIRECT($EY$7),$B19,EY$8)))","v":false},{"$f":"IF(OR($EY$5=\"P\",$EY$5=\"SS\",$EY$5=\"S\"),INDEX(INDIRECT($EY$6),$B19,EZ$8),\nIF(OR($EY$5=\"N\",$EY$5=\"AP\",$EY$5=\"AT\",$EY$5=\"SP\"),INDEX(INDIRECT($EY$7),$B19,EZ$8)))","v":false},{"$f":"IF(OR($EY$5=\"P\",$EY$5=\"SS\",$EY$5=\"S\"),INDEX(INDIRECT($EY$6),$B19,FA$8),\nIF(OR($EY$5=\"N\",$EY$5=\"AP\",$EY$5=\"AT\",$EY$5=\"SP\"),INDEX(INDIRECT($EY$7),$B19,FA$8)))","v":false},false,{"$f":"IF(OR($EY$5=\"P\",$EY$5=\"SS\",$EY$5=\"S\"),INDEX(INDIRECT($EY$6),$B19,FC$8),\nIF(OR($EY$5=\"N\",$EY$5=\"AP\",$EY$5=\"AT\",$EY$5=\"SP\"),INDEX(INDIRECT($EY$7),$B19,FC$8)))","v":false},false,false]
["Average class size",12,{"$f":"IF(OR($C$5=\"P\",$C$5=\"SS\",$C$5=\"S\"),INDEX(INDIRECT($C$6),$B20,C$8),\nIF(OR($C$5=\"N\",$C$5=\"AP\",$C$5=\"SP\"),\"\",IF($C$5=\"AT\",INDEX(INDIRECT($C$7),$B20,C$8))))","v":{"v":19,"d":"19.0"}},19.5,20.5,{"v":21,"d":"21.0"},21.5,{"v":22,"d":"22.0"},{"v":23,"d":"23.0"},null,{"$f":"IF(OR($K$5=\"P\",$K$5=\"SS\",$K$5=\"S\"),INDEX(INDIRECT($K$6),$B20,K$8),\nIF(OR($K$5=\"N\",$K$5=\"AP\",$K$5=\"SP\"),\"\",IF($K$5=\"AT\",INDEX(INDIRECT($K$7),$B20,K$8))))","v":false},false,false,false,false,false,false,null,{"$f":"IF(OR($S$5=\"P\",$S$5=\"SS\",$S$5=\"S\"),INDEX(INDIRECT($S$6),$B20,S$8),\nIF(OR($S$5=\"N\",$S$5=\"AP\",$S$5=\"SP\"),\"\",IF($S$5=\"AT\",INDEX(INDIRECT($S$7),$B20,S$8))))","v":false},false,false,false,false,false,false,null,{"$f":"IF(OR($AA$5=\"P\",$AA$5=\"SS\",$AA$5=\"S\"),INDEX(INDIRECT($AA$6),$B20,AA$8),\nIF(OR($AA$5=\"N\",$AA$5=\"AP\",$AA$5=\"SP\"),\"\",IF($AA$5=\"AT\",INDEX(INDIRECT($AA$7),$B20,AA$8))))","v":false},false,false,false,false,false,false,null,{"$f":"IF(OR($AI$5=\"P\",$AI$5=\"SS\",$AI$5=\"S\"),INDEX(INDIRECT($AI$6),$B20,AI$8),\nIF(OR($AI$5=\"N\",$AI$5=\"AP\",$AI$5=\"SP\"),\"\",IF($AI$5=\"AT\",INDEX(INDIRECT($AI$7),$B20,AI$8))))","v":false},false,false,false,false,false,false,null,{"$f":"IF(OR($AQ$5=\"P\",$AQ$5=\"SS\",$AQ$5=\"S\"),INDEX(INDIRECT($AQ$6),$B20,AQ$8),\nIF(OR($AQ$5=\"N\",$AQ$5=\"AP\",$AQ$5=\"SP\"),\"\",IF($AQ$5=\"AT\",INDEX(INDIRECT($AQ$7),$B20,AQ$8))))","v":false},false,false,false,false,false,false,null,{"$f":"IF(OR($AY$5=\"P\",$AY$5=\"SS\",$AY$5=\"S\"),INDEX(INDIRECT($AY$6),$B20,AY$8),\nIF(OR($AY$5=\"N\",$AY$5=\"AP\",$AY$5=\"SP\"),\"\",IF($AY$5=\"AT\",INDEX(INDIRECT($AY$7),$B20,AY$8))))","v":false},false,false,false,false,false,false,null,{"$f":"IF(OR($BG$5=\"P\",$BG$5=\"SS\",$BG$5=\"S\"),INDEX(INDIRECT($BG$6),$B20,BG$8),\nIF(OR($BG$5=\"N\",$BG$5=\"AP\",$BG$5=\"SP\"),\"\",IF($BG$5=\"AT\",INDEX(INDIRECT($BG$7),$B20,BG$8))))","v":false},false,false,false,false,false,false,null,{"$f":"IF(OR($BO$5=\"P\",$BO$5=\"SS\",$BO$5=\"S\"),INDEX(INDIRECT($BO$6),$B20,BO$8),\nIF(OR($BO$5=\"N\",$BO$5=\"AP\",$BO$5=\"SP\"),\"\",IF($BO$5=\"AT\",INDEX(INDIRECT($BO$7),$B20,BO$8))))","v":false},false,false,false,false,false,false,null,{"$f":"IF(OR($BW$5=\"P\",$BW$5=\"SS\",$BW$5=\"S\"),INDEX(INDIRECT($BW$6),$B20,BW$8),\nIF(OR($BW$5=\"N\",$BW$5=\"AP\",$BW$5=\"SP\"),\"\",IF($BW$5=\"AT\",INDEX(INDIRECT($BW$7),$B20,BW$8))))","v":false},false,false,false,false,false,false,null,{"$f":"IF(OR($CE$5=\"P\",$CE$5=\"SS\",$CE$5=\"S\"),INDEX(INDIRECT($CE$6),$B20,CE$8),\nIF(OR($CE$5=\"N\",$CE$5=\"AP\",$CE$5=\"SP\"),\"\",IF($CE$5=\"AT\",INDEX(INDIRECT($CE$7),$B20,CE$8))))","v":false},false,false,false,false,false,false,null,{"$f":"IF(OR($CM$5=\"P\",$CM$5=\"SS\",$CM$5=\"S\"),INDEX(INDIRECT($CM$6),$B20,CM$8),\nIF(OR($CM$5=\"N\",$CM$5=\"AP\",$CM$5=\"SP\"),\"\",IF($CM$5=\"AT\",INDEX(INDIRECT($CM$7),$B20,CM$8))))","v":false},false,false,false,false,false,false,null,{"$f":"IF(OR($CU$5=\"P\",$CU$5=\"SS\",$CU$5=\"S\"),INDEX(INDIRECT($CU$6),$B20,CU$8),\nIF(OR($CU$5=\"N\",$CU$5=\"AP\",$CU$5=\"SP\"),\"\",IF($CU$5=\"AT\",INDEX(INDIRECT($CU$7),$B20,CU$8))))","v":false},false,false,false,false,false,false,null,{"$f":"IF(OR($DC$5=\"P\",$DC$5=\"SS\",$DC$5=\"S\"),INDEX(INDIRECT($DC$6),$B20,DC$8),\nIF(OR($DC$5=\"N\",$DC$5=\"AP\",$DC$5=\"SP\"),\"\",IF($DC$5=\"AT\",INDEX(INDIRECT($DC$7),$B20,DC$8))))","v":false},false,false,false,false,false,false,null,{"$f":"IF(OR($DK$5=\"P\",$DK$5=\"SS\",$DK$5=\"S\"),INDEX(INDIRECT($DK$6),$B20,DK$8),\nIF(OR($DK$5=\"N\",$DK$5=\"AP\",$DK$5=\"SP\"),\"\",IF($DK$5=\"AT\",INDEX(INDIRECT($DK$7),$B20,DK$8))))","v":false},false,false,false,false,false,false,null,{"$f":"IF(OR($DS$5=\"P\",$DS$5=\"SS\",$DS$5=\"S\"),INDEX(INDIRECT($DS$6),$B20,DS$8),\nIF(OR($DS$5=\"N\",$DS$5=\"AP\",$DS$5=\"SP\"),\"\",IF($DS$5=\"AT\",INDEX(INDIRECT($DS$7),$B20,DS$8))))","v":false},false,false,false,false,false,false,null,{"$f":"IF(OR($EA$5=\"P\",$EA$5=\"SS\",$EA$5=\"S\"),INDEX(INDIRECT($EA$6),$B20,EA$8),\nIF(OR($EA$5=\"N\",$EA$5=\"AP\",$EA$5=\"SP\"),\"\",IF($EA$5=\"AT\",INDEX(INDIRECT($EA$7),$B20,EA$8))))","v":false},false,false,false,false,false,false,null,{"$f":"IF(OR($EI$5=\"P\",$EI$5=\"SS\",$EI$5=\"S\"),INDEX(INDIRECT($EI$6),$B20,EI$8),\nIF(OR($EI$5=\"N\",$EI$5=\"AP\",$EI$5=\"SP\"),\"\",IF($EI$5=\"AT\",INDEX(INDIRECT($EI$7),$B20,EI$8))))","v":false},false,false,false,false,false,false,null,{"$f":"IF(OR($EQ$5=\"P\",$EQ$5=\"SS\",$EQ$5=\"S\"),INDEX(INDIRECT($EQ$6),$B20,EQ$8),\nIF(OR($EQ$5=\"N\",$EQ$5=\"AP\",$EQ$5=\"SP\"),\"\",IF($EQ$5=\"AT\",INDEX(INDIRECT($EQ$7),$B20,EQ$8))))","v":false},false,false,false,false,false,false,null,{"$f":"IF(OR($EY$5=\"P\",$EY$5=\"SS\",$EY$5=\"S\"),INDEX(INDIRECT($EY$6),$B20,EY$8),\nIF(OR($EY$5=\"N\",$EY$5=\"AP\",$EY$5=\"SP\"),\"\",IF($EY$5=\"AT\",INDEX(INDIRECT($EY$7),$B20,EY$8))))","v":false},false,false,false,false,false,false]
["Average teacher cost",13,{"$f":"IF(OR($C$5=\"P\",$C$5=\"SS\",$C$5=\"S\"),INDEX(INDIRECT($C$7),1,C$8),\nIF(OR($C$5=\"N\",$C$5=\"AP\",$C$5=\"SP\"),INDEX(INDIRECT($C$7),$B20,C$8),\nIF($C$5=\"AT\",INDEX(INDIRECT($C$7),$B21,C$8))))","v":{"v":51000,"d":"£51,000"}},{"$f":"IF(OR($C$5=\"P\",$C$5=\"SS\",$C$5=\"S\"),INDEX(INDIRECT($C$7),1,D$8),\nIF(OR($C$5=\"N\",$C$5=\"AP\",$C$5=\"SP\"),INDEX(INDIRECT($C$7),$B20,D$8),\nIF($C$5=\"AT\",INDEX(INDIRECT($C$7),$B21,D$8))))","v":{"v":53500,"d":"£53,500"}},{"v":56000,"d":"£56,000"},{"v":57000,"d":"£57,000"},{"v":58000,"d":"£58,000"},{"v":60500,"d":"£60,500"},{"v":62500,"d":"£62,500"},null,{"$f":"IF(OR($K$5=\"P\",$K$5=\"SS\",$K$5=\"S\"),INDEX(INDIRECT($K$7),1,K$8),\nIF(OR($K$5=\"N\",$K$5=\"AP\",$K$5=\"SP\"),INDEX(INDIRECT($K$7),$B20,K$8),\nIF($K$5=\"AT\",INDEX(INDIRECT($K$7),$B21,K$8))))","v":false},false,false,false,false,false,false,null,{"$f":"IF(OR($S$5=\"P\",$S$5=\"SS\",$S$5=\"S\"),INDEX(INDIRECT($S$7),1,S$8),\nIF(OR($S$5=\"N\",$S$5=\"AP\",$S$5=\"SP\"),INDEX(INDIRECT($S$7),$B20,S$8),\nIF($S$5=\"AT\",INDEX(INDIRECT($S$7),$B21,S$8))))","v":false},false,false,false,false,false,false,null,{"$f":"IF(OR($AA$5=\"P\",$AA$5=\"SS\",$AA$5=\"S\"),INDEX(INDIRECT($AA$7),1,AA$8),\nIF(OR($AA$5=\"N\",$AA$5=\"AP\",$AA$5=\"SP\"),INDEX(INDIRECT($AA$7),$B20,AA$8),\nIF($AA$5=\"AT\",INDEX(INDIRECT($AA$7),$B21,AA$8))))","v":false},false,false,false,false,false,false,null,{"$f":"IF(OR($AI$5=\"P\",$AI$5=\"SS\",$AI$5=\"S\"),INDEX(INDIRECT($AI$7),1,AI$8),\nIF(OR($AI$5=\"N\",$AI$5=\"AP\",$AI$5=\"SP\"),INDEX(INDIRECT($AI$7),$B20,AI$8),\nIF($AI$5=\"AT\",INDEX(INDIRECT($AI$7),$B21,AI$8))))","v":false},false,false,false,false,false,false,null,{"$f":"IF(OR($AQ$5=\"P\",$AQ$5=\"SS\",$AQ$5=\"S\"),INDEX(INDIRECT($AQ$7),1,AQ$8),\nIF(OR($AQ$5=\"N\",$AQ$5=\"AP\",$AQ$5=\"SP\"),INDEX(INDIRECT($AQ$7),$B20,AQ$8),\nIF($AQ$5=\"AT\",INDEX(INDIRECT($AQ$7),$B21,AQ$8))))","v":false},false,false,false,false,false,false,null,{"$f":"IF(OR($AY$5=\"P\",$AY$5=\"SS\",$AY$5=\"S\"),INDEX(INDIRECT($AY$7),1,AY$8),\nIF(OR($AY$5=\"N\",$AY$5=\"AP\",$AY$5=\"SP\"),INDEX(INDIRECT($AY$7),$B20,AY$8),\nIF($AY$5=\"AT\",INDEX(INDIRECT($AY$7),$B21,AY$8))))","v":false},false,false,false,false,false,false,null,{"$f":"IF(OR($BG$5=\"P\",$BG$5=\"SS\",$BG$5=\"S\"),INDEX(INDIRECT($BG$7),1,BG$8),\nIF(OR($BG$5=\"N\",$BG$5=\"AP\",$BG$5=\"SP\"),INDEX(INDIRECT($BG$7),$B20,BG$8),\nIF($BG$5=\"AT\",INDEX(INDIRECT($BG$7),$B21,BG$8))))","v":false},false,false,false,false,false,false,null,{"$f":"IF(OR($BO$5=\"P\",$BO$5=\"SS\",$BO$5=\"S\"),INDEX(INDIRECT($BO$7),1,BO$8),\nIF(OR($BO$5=\"N\",$BO$5=\"AP\",$BO$5=\"SP\"),INDEX(INDIRECT($BO$7),$B20,BO$8),\nIF($BO$5=\"AT\",INDEX(INDIRECT($BO$7),$B21,BO$8))))","v":false},false,false,false,false,false,false,null,{"$f":"IF(OR($BW$5=\"P\",$BW$5=\"SS\",$BW$5=\"S\"),INDEX(INDIRECT($BW$7),1,BW$8),\nIF(OR($BW$5=\"N\",$BW$5=\"AP\",$BW$5=\"SP\"),INDEX(INDIRECT($BW$7),$B20,BW$8),\nIF($BW$5=\"AT\",INDEX(INDIRECT($BW$7),$B21,BW$8))))","v":false},false,false,false,false,false,false,null,{"$f":"IF(OR($CE$5=\"P\",$CE$5=\"SS\",$CE$5=\"S\"),INDEX(INDIRECT($CE$7),1,CE$8),\nIF(OR($CE$5=\"N\",$CE$5=\"AP\",$CE$5=\"SP\"),INDEX(INDIRECT($CE$7),$B20,CE$8),\nIF($CE$5=\"AT\",INDEX(INDIRECT($CE$7),$B21,CE$8))))","v":false},false,false,false,false,false,false,null,{"$f":"IF(OR($CM$5=\"P\",$CM$5=\"SS\",$CM$5=\"S\"),INDEX(INDIRECT($CM$7),1,CM$8),\nIF(OR($CM$5=\"N\",$CM$5=\"AP\",$CM$5=\"SP\"),INDEX(INDIRECT($CM$7),$B20,CM$8),\nIF($CM$5=\"AT\",INDEX(INDIRECT($CM$7),$B21,CM$8))))","v":false},false,false,false,false,false,false,null,{"$f":"IF(OR($CU$5=\"P\",$CU$5=\"SS\",$CU$5=\"S\"),INDEX(INDIRECT($CU$7),1,CU$8),\nIF(OR($CU$5=\"N\",$CU$5=\"AP\",$CU$5=\"SP\"),INDEX(INDIRECT($CU$7),$B20,CU$8),\nIF($CU$5=\"AT\",INDEX(INDIRECT($CU$7),$B21,CU$8))))","v":false},false,false,false,false,false,false,null,{"$f":"IF(OR($DC$5=\"P\",$DC$5=\"SS\",$DC$5=\"S\"),INDEX(INDIRECT($DC$7),1,DC$8),\nIF(OR($DC$5=\"N\",$DC$5=\"AP\",$DC$5=\"SP\"),INDEX(INDIRECT($DC$7),$B20,DC$8),\nIF($DC$5=\"AT\",INDEX(INDIRECT($DC$7),$B21,DC$8))))","v":false},false,false,false,false,false,false,null,{"$f":"IF(OR($DK$5=\"P\",$DK$5=\"SS\",$DK$5=\"S\"),INDEX(INDIRECT($DK$7),1,DK$8),\nIF(OR($DK$5=\"N\",$DK$5=\"AP\",$DK$5=\"SP\"),INDEX(INDIRECT($DK$7),$B20,DK$8),\nIF($DK$5=\"AT\",INDEX(INDIRECT($DK$7),$B21,DK$8))))","v":false},false,false,false,false,false,false,null,{"$f":"IF(OR($DS$5=\"P\",$DS$5=\"SS\",$DS$5=\"S\"),INDEX(INDIRECT($DS$7),1,DS$8),\nIF(OR($DS$5=\"N\",$DS$5=\"AP\",$DS$5=\"SP\"),INDEX(INDIRECT($DS$7),$B20,DS$8),\nIF($DS$5=\"AT\",INDEX(INDIRECT($DS$7),$B21,DS$8))))","v":false},false,false,false,false,false,false,null,{"$f":"IF(OR($EA$5=\"P\",$EA$5=\"SS\",$EA$5=\"S\"),INDEX(INDIRECT($EA$7),1,EA$8),\nIF(OR($EA$5=\"N\",$EA$5=\"AP\",$EA$5=\"SP\"),INDEX(INDIRECT($EA$7),$B20,EA$8),\nIF($EA$5=\"AT\",INDEX(INDIRECT($EA$7),$B21,EA$8))))","v":false},false,false,false,false,false,false,null,{"$f":"IF(OR($EI$5=\"P\",$EI$5=\"SS\",$EI$5=\"S\"),INDEX(INDIRECT($EI$7),1,EI$8),\nIF(OR($EI$5=\"N\",$EI$5=\"AP\",$EI$5=\"SP\"),INDEX(INDIRECT($EI$7),$B20,EI$8),\nIF($EI$5=\"AT\",INDEX(INDIRECT($EI$7),$B21,EI$8))))","v":false},false,false,false,false,false,false,null,{"$f":"IF(OR($EQ$5=\"P\",$EQ$5=\"SS\",$EQ$5=\"S\"),INDEX(INDIRECT($EQ$7),1,EQ$8),\nIF(OR($EQ$5=\"N\",$EQ$5=\"AP\",$EQ$5=\"SP\"),INDEX(INDIRECT($EQ$7),$B20,EQ$8),\nIF($EQ$5=\"AT\",INDEX(INDIRECT($EQ$7),$B21,EQ$8))))","v":false},false,false,false,false,false,false,null,{"$f":"IF(OR($EY$5=\"P\",$EY$5=\"SS\",$EY$5=\"S\"),INDEX(INDIRECT($EY$7),1,EY$8),\nIF(OR($EY$5=\"N\",$EY$5=\"AP\",$EY$5=\"SP\"),INDEX(INDIRECT($EY$7),$B20,EY$8),\nIF($EY$5=\"AT\",INDEX(INDIRECT($EY$7),$B21,EY$8))))","v":false},false,false,false,false,false,false]
[]
[]
[]
[]
["Information for the 'RAG rating data for your school' look ups"]
[]
["School name from dashboard",null,null,"Named ranges for RAG ratings above","School information from dashboard",{"$nulls":3},"Info for comparison description"]
[{"$f":"IF(Dashboard!H$13=0,\"\",Dashboard!H$13)","v":"Shenfield High School"},1,"H","A",{"$f":"IF(Dashboard!H$14=0,\"\",Dashboard!H$14)","v":"Secondary with sixth form"},{"$f":"IF(Dashboard!H$15=0,\"\",Dashboard!H$15)","v":"East of England"},{"$f":"IF(Dashboard!H$16=0,\"\",Dashboard!H$16)","v":1352},{"$f":"IF(Dashboard!H$17=0,\"\",Dashboard!H$17)","v":0.0614},{"$f":"IF(F29=\"\",\"\",IF(OR(F29=\"Inner London\",F29=\"Outer London\"),\"in London\",\"outside London\"))","v":"outside London"},{"$f":"IF(AND(E29=\"Primary\",G29<=$X$30),\"very small\",IF(AND(E29=\"Primary\",G29<=$Y$30,G29>$X$30),\"small\",IF(AND(E29=\"Primary\",G29>$Y$30,G29<=$Z$30),\"medium\",IF(AND(E29=\"Primary\",G29>$Z$30),\"large\",\nIF(AND(E29=\"Secondary with sixth form\",G29<=$Y$31),\"small\",IF(AND(E29=\"Secondary with sixth form\",G29>$Y$31,G29<=$Z$31),\"medium\",IF(AND(E29=\"Secondary with sixth form\",G29>$Z$31),\"large\",\nIF(AND(E29=\"Secondary without sixth form\",G29<=$Y$32),\"small\",IF(AND(E29=\"Secondary without sixth form\",G29>$Y$32,G29<=$Z$32),\"medium\",IF(AND(E29=\"Secondary without sixth form\",G29>$Z$32),\"large\",\"\"))))))))))","v":"large"},{"$f":"IF(AND(E29=\"Primary\",H29<=$X$35),\"low levels of FSM\",IF(AND(E29=\"Primary\",H29>$X$35,H29<=$Y$35),\"medium levels of FSM\",IF(AND(E29=\"Primary\",H29>$Y$35),\"high levels of FSM\",\nIF(AND(E29=\"Secondary with sixth form\",H29<=$X$36),\"low levels of FSM\",IF(AND(E29=\"Secondary with sixth form\",H29>$X$36,H29<=$Y$36),\"medium levels of FSM\",IF(AND(E29=\"Secondary with sixth form\",H29>$Y$36),\"high levels of FSM\",\nIF(AND(E29=\"Secondary without sixth form\",H29<=$X$37),\"low levels of FSM\",IF(AND(E29=\"Secondary without sixth form\",H29>$X$37,H29<=$Y$37),\"medium levels of FSM\",IF(AND(E29=\"Secondary without sixth form\",H29>$Y$37),\"high levels of FSM\",\"\")))))))))","v":"medium levels of FSM"},{"$f":"IF(E29=\"Primary\",\"a primary school\",IF(E29=\"Secondary with sixth form\",\"a secondary school with a sixth form\",IF(E29=\"Secondary without sixth form\",\"a secondary school without a sixth form\",IF(E29=\"Special\",\"a special school\",IF(E29=\"Alternative provision\",\"an alternative provision school\",IF(E29=\"All-through\",\"an all-through school\",IF(E29=\"Nursery\",\"a nursery school\",\"\")))))))","v":"a secondary school with a sixth form"},{"$f":"IF(AND(E29=\"Primary\",J29=\"very small\"),$X$30&\" or fewer pupils\",\nIF(AND(E29=\"Primary\",J29=\"small\"),\"between \"&$X$30+1&\" and \"&$Y$30&\" pupils\",\nIF(AND(E29=\"Primary\",J29=\"medium\"),\"between \"&$Y$30+1&\" and \"&$Z$30&\" pupils\",\nIF(AND(E29=\"Primary\",J29=\"large\"),\"more than \"&$Z$30&\" pupils\",\n\nIF(AND(E29=\"Secondary with sixth form\",J29=\"small\"),$Y$31&\" or fewer pupils\",\nIF(AND(E29=\"Secondary with sixth form\",J29=\"medium\"),\"between \"&$Y$31+1&\" and \"&$Z$31&\" pupils\",\nIF(AND(E29=\"Secondary with sixth form\",J29=\"large\"),\"more than \"&$Z$31&\" pupils\",\n\nIF(AND(E29=\"Secondary without sixth form\",J29=\"small\"),$Y$32&\" or fewer pupils\",\nIF(AND(E29=\"Secondary without sixth form\",J29=\"medium\"),\"between \"&$Y$32+1&\" and \"&$Z$32&\" pupils\",\nIF(AND(E29=\"Secondary without sixth form\",J29=\"large\"),\"more than \"&$Z$32&\" pupils\",\"\"))))))))))","v":"more than 1300 pupils"},{"$f":"IF(AND(E29=\"Primary\",K29=\"low levels of FSM\"),\"less than \"&$Z$35&\" of pupils\",\nIF(AND(E29=\"Primary\",K29=\"medium levels of FSM\"),\"between \"&$Z$35&\" and \"&$AA$35&\" of pupils\",\nIF(AND(E29=\"Primary\",K29=\"high levels of FSM\"),\"more than \"&$AA$35&\" of pupils\",\n\nIF(AND(E29=\"Secondary with sixth form\",K29=\"low levels of FSM\"),\"less than \"&$Z$36&\" of pupils\",\nIF(AND(E29=\"Secondary with sixth form\",K29=\"medium levels of FSM\"),\"between \"&$Z$36&\" and \"&$AA$36&\" of pupils\",\nIF(AND(E29=\"Secondary with sixth form\",K29=\"high levels of FSM\"),\"more than \"&$AA$36&\" of pupils\",\n\nIF(AND(E29=\"Secondary without sixth form\",K29=\"low levels of FSM\"),\"less than \"&$Z$37&\" of pupils\",\nIF(AND(E29=\"Secondary without sixth form\",K29=\"medium levels of FSM\"),\"between \"&$Z$37&\" and \"&$AA$37&\" of pupils\",\nIF(AND(E29=\"Secondary without sixth form\",K29=\"high levels of FSM\"),\"more than \"&$AA$37&\" of pupils\",\"\")))))))))","v":"between 6% and 16.5% of pupils"},{"$nulls":9},"Very small","Small","Medium"]
[{"$f":"IF(Dashboard!L$13=0,\"\",Dashboard!L$13)","v":""},2,"L","B",{"$f":"IF(Dashboard!L$14=0,\"\",Dashboard!L$14)","v":""},{"$f":"IF(Dashboard!L$15=0,\"\",Dashboard!L$15)","v":""},{"$f":"IF(Dashboard!L$16=0,\"\",Dashboard!L$16)","v":""},{"$f":"IF(Dashboard!L$17=0,\"\",Dashboard!L$17)","v":""},{"$f":"IF(F30=\"\",\"\",IF(OR(F30=\"Inner London\",F30=\"Outer London\"),\"in London\",\"outside London\"))","v":""},{"$f":"IF(AND(E30=\"Primary\",G30<=$X$30),\"very small\",IF(AND(E30=\"Primary\",G30<=$Y$30,G30>$X$30),\"small\",IF(AND(E30=\"Primary\",G30>$Y$30,G30<=$Z$30),\"medium\",IF(AND(E30=\"Primary\",G30>$Z$30),\"large\",\nIF(AND(E30=\"Secondary with sixth form\",G30<=$Y$31),\"small\",IF(AND(E30=\"Secondary with sixth form\",G30>$Y$31,G30<=$Z$31),\"medium\",IF(AND(E30=\"Secondary with sixth form\",G30>$Z$31),\"large\",\nIF(AND(E30=\"Secondary without sixth form\",G30<=$Y$32),\"small\",IF(AND(E30=\"Secondary without sixth form\",G30>$Y$32,G30<=$Z$32),\"medium\",IF(AND(E30=\"Secondary without sixth form\",G30>$Z$32),\"large\",\"\"))))))))))","v":""},{"$f":"IF(AND(E30=\"Primary\",H30<=$X$35),\"low levels of FSM\",IF(AND(E30=\"Primary\",H30>$X$35,H30<=$Y$35),\"medium levels of FSM\",IF(AND(E30=\"Primary\",H30>$Y$35),\"high levels of FSM\",\nIF(AND(E30=\"Secondary with sixth form\",H30<=$X$36),\"low levels of FSM\",IF(AND(E30=\"Secondary with sixth form\",H30>$X$36,H30<=$Y$36),\"medium levels of FSM\",IF(AND(E30=\"Secondary with sixth form\",H30>$Y$36),\"high levels of FSM\",\nIF(AND(E30=\"Secondary without sixth form\",H30<=$X$37),\"low levels of FSM\",IF(AND(E30=\"Secondary without sixth form\",H30>$X$37,H30<=$Y$37),\"medium levels of FSM\",IF(AND(E30=\"Secondary without sixth form\",H30>$Y$37),\"high levels of FSM\",\"\")))))))))","v":""},{"$f":"IF(E30=\"Primary\",\"a primary school\",IF(E30=\"Secondary with sixth form\",\"a secondary school with a sixth form\",IF(E30=\"Secondary without sixth form\",\"a secondary school without a sixth form\",IF(E30=\"Special\",\"a special school\",IF(E30=\"Alternative provision\",\"an alternative provision school\",IF(E30=\"All-through\",\"an all-through school\",IF(E30=\"Nursery\",\"a nursery school\",\"\")))))))","v":""},{"$f":"IF(AND(E30=\"Primary\",J30=\"very small\"),$X$30&\" or fewer pupils\",\nIF(AND(E30=\"Primary\",J30=\"small\"),\"between \"&$X$30+1&\" and \"&$Y$30&\" pupils\",\nIF(AND(E30=\"Primary\",J30=\"medium\"),\"between \"&$Y$30+1&\" and \"&$Z$30&\" pupils\",\nIF(AND(E30=\"Primary\",J30=\"large\"),\"more than \"&$Z$30&\" pupils\",\n\nIF(AND(E30=\"Secondary with sixth form\",J30=\"small\"),$Y$31&\" or fewer pupils\",\nIF(AND(E30=\"Secondary with sixth form\",J30=\"medium\"),\"between \"&$Y$31+1&\" and \"&$Z$31&\" pupils\",\nIF(AND(E30=\"Secondary with sixth form\",J30=\"large\"),\"more than \"&$Z$31&\" pupils\",\n\nIF(AND(E30=\"Secondary without sixth form\",J30=\"small\"),$Y$32&\" or fewer pupils\",\nIF(AND(E30=\"Secondary without sixth form\",J30=\"medium\"),\"between \"&$Y$32+1&\" and \"&$Z$32&\" pupils\",\nIF(AND(E30=\"Secondary without sixth form\",J30=\"large\"),\"more than \"&$Z$32&\" pupils\",\"\"))))))))))","v":""},"",{"$nulls":8},"Primary",100,175,385]
[{"$f":"IF(Dashboard!P$13=0,\"\",Dashboard!P$13)","v":""},3,"P","CC",{"$f":"IF(Dashboard!P$14=0,\"\",Dashboard!P$14)","v":""},{"$f":"IF(Dashboard!P$15=0,\"\",Dashboard!P$15)","v":""},{"$f":"IF(Dashboard!P$16=0,\"\",Dashboard!P$16)","v":""},{"$f":"IF(Dashboard!P$17=0,\"\",Dashboard!P$17)","v":""},"","","","","","",{"$nulls":8},"Secondary with sixth form",null,770,1300]
[{"$f":"IF(Dashboard!T$13=0,\"\",Dashboard!T$13)","v":""},4,"T","D",{"$f":"IF(Dashboard!T$14=0,\"\",Dashboard!T$14)","v":""},{"$f":"IF(Dashboard!T$15=0,\"\",Dashboard!T$15)","v":""},{"$f":"IF(Dashboard!T$16=0,\"\",Dashboard!T$16)","v":""},{"$f":"IF(Dashboard!T$17=0,\"\",Dashboard!T$17)","v":""},"","","","","","",{"$nulls":8},"Secondary without sixth form",null,485,935]
[{"$f":"IF(Dashboard!X$13=0,\"\",Dashboard!X$13)","v":""},5,"X","E",{"$f":"IF(Dashboard!X$14=0,\"\",Dashboard!X$14)","v":""},{"$f":"IF(Dashboard!X$15=0,\"\",Dashboard!X$15)","v":""},{"$f":"IF(Dashboard!X$16=0,\"\",Dashboard!X$16)","v":""},{"$f":"IF(Dashboard!X$17=0,\"\",Dashboard!X$17)","v":""},"","","","","",""]
[{"$f":"IF(Dashboard!AB$13=0,\"\",Dashboard!AB$13)","v":""},6,"AB","F",{"$f":"IF(Dashboard!AB$14=0,\"\",Dashboard!AB$14)","v":""},{"$f":"IF(Dashboard!AB$15=0,\"\",Dashboard!AB$15)","v":""},{"$f":"IF(Dashboard!AB$16=0,\"\",Dashboard!AB$16)","v":""},{"$f":"IF(Dashboard!AB$17=0,\"\",Dashboard!AB$17)","v":""},"","","","","","",{"$nulls":9},"Low","Medium"]
[{"$f":"IF(Dashboard!AF$13=0,\"\",Dashboard!AF$13)","v":""},7,"AF","G",{"$f":"IF(Dashboard!AF$14=0,\"\",Dashboard!AF$14)","v":""},{"$f":"IF(Dashboard!AF$15=0,\"\",Dashboard!AF$15)","v":""},{"$f":"IF(Dashboard!AF$16=0,\"\",Dashboard!AF$16)","v":""},{"$f":"IF(Dashboard!AF$17=0,\"\",Dashboard!AF$17)","v":""},"","","","","","",{"$nulls":8},"Primary",0.05,0.18,{"$f":"(X35*100)&\"%\"","v":"5%"},"18%"]
[{"$f":"IF(Dashboard!AJ$13=0,\"\",Dashboard!AJ$13)","v":""},8,"AJ","H",{"$f":"IF(Dashboard!AJ$14=0,\"\",Dashboard!AJ$14)","v":""},{"$f":"IF(Dashboard!AJ$15=0,\"\",Dashboard!AJ$15)","v":""},{"$f":"IF(Dashboard!AJ$16=0,\"\",Dashboard!AJ$16)","v":""},{"$f":"IF(Dashboard!AJ$17=0,\"\",Dashboard!AJ$17)","v":""},"","","","","","",{"$nulls":8},"Secondary with sixth form",0.06,0.165,"6%","16.5%"]
[{"$f":"IF(Dashboard!AN$13=0,\"\",Dashboard!AN$13)","v":""},9,"AN","I",{"$f":"IF(Dashboard!AN$14=0,\"\",Dashboard!AN$14)","v":""},{"$f":"IF(Dashboard!AN$15=0,\"\",Dashboard!AN$15)","v":""},{"$f":"IF(Dashboard!AN$16=0,\"\",Dashboard!AN$16)","v":""},{"$f":"IF(Dashboard!AN$17=0,\"\",Dashboard!AN$17)","v":""},"","","","","","",{"$nulls":8},"Secondary without sixth form",0.08,0.215,"8%","21.5%"]
[{"$f":"IF(Dashboard!AR$13=0,\"\",Dashboard!AR$13)","v":""},10,"AR","J",{"$f":"IF(Dashboard!AR$14=0,\"\",Dashboard!AR$14)","v":""},{"$f":"IF(Dashboard!AR$15=0,\"\",Dashboard!AR$15)","v":""},{"$f":"IF(Dashboard!AR$16=0,\"\",Dashboard!AR$16)","v":""},{"$f":"IF(Dashboard!AR$17=0,\"\",Dashboard!AR$17)","v":""},"","","","","",""]
[{"$f":"IF(Dashboard!AV$13=0,\"\",Dashboard!AV$13)","v":""},11,"AV","K",{"$f":"IF(Dashboard!AV$14=0,\"\",Dashboard!AV$14)","v":""},{"$f":"IF(Dashboard!AV$15=0,\"\",Dashboard!AV$15)","v":""},{"$f":"IF(Dashboard!AV$16=0,\"\",Dashboard!AV$16)","v":""},{"$f":"IF(Dashboard!AV$17=0,\"\",Dashboard!AV$17)","v":""},"","","","","",""]
[{"$f":"IF(Dashboard!AZ$13=0,\"\",Dashboard!AZ$13)","v":""},12,"AZ","L",{"$f":"IF(Dashboard!AZ$14=0,\"\",Dashboard!AZ$14)","v":""},{"$f":"IF(Dashboard!AZ$15=0,\"\",Dashboard!AZ$15)","v":""},{"$f":"IF(Dashboard!AZ$16=0,\"\",Dashboard!AZ$16)","v":""},{"$f":"IF(Dashboard!AZ$17=0,\"\",Dashboard!AZ$17)","v":""},"","","","","",""]
[{"$f":"IF(Dashboard!BD$13=0,\"\",Dashboard!BD$13)","v":""},13,"BD","M",{"$f":"IF(Dashboard!BD$14=0,\"\",Dashboard!BD$14)","v":""},{"$f":"IF(Dashboard!BD$15=0,\"\",Dashboard!BD$15)","v":""},{"$f":"IF(Dashboard!BD$16=0,\"\",Dashboard!BD$16)","v":""},{"$f":"IF(Dashboard!BD$17=0,\"\",Dashboard!BD$17)","v":""},"","","","","",""]
[{"$f":"IF(Dashboard!BH$13=0,\"\",Dashboard!BH$13)","v":""},14,"BH","N",{"$f":"IF(Dashboard!BH$14=0,\"\",Dashboard!BH$14)","v":""},{"$f":"IF(Dashboard!BH$15=0,\"\",Dashboard!BH$15)","v":""},{"$f":"IF(Dashboard!BH$16=0,\"\",Dashboard!BH$16)","v":""},{"$f":"IF(Dashboard!BH$17=0,\"\",Dashboard!BH$17)","v":""},"","","","","",""]
[{"$f":"IF(Dashboard!BL$13=0,\"\",Dashboard!BL$13)","v":""},15,"BL","O",{"$f":"IF(Dashboard!BL$14=0,\"\",Dashboard!BL$14)","v":""},{"$f":"IF(Dashboard!BL$15=0,\"\",Dashboard!BL$15)","v":""},{"$f":"IF(Dashboard!BL$16=0,\"\",Dashboard!BL$16)","v":""},{"$f":"IF(Dashboard!BL$17=0,\"\",Dashboard!BL$17)","v":""},"","","","","",""]
[{"$f":"IF(Dashboard!BP$13=0,\"\",Dashboard!BP$13)","v":""},16,"BP","P",{"$f":"IF(Dashboard!BP$14=0,\"\",Dashboard!BP$14)","v":""},{"$f":"IF(Dashboard!BP$15=0,\"\",Dashboard!BP$15)","v":""},{"$f":"IF(Dashboard!BP$16=0,\"\",Dashboard!BP$16)","v":""},{"$f":"IF(Dashboard!BP$17=0,\"\",Dashboard!BP$17)","v":""},"","","","","",""]
[{"$f":"IF(Dashboard!BT$13=0,\"\",Dashboard!BT$13)","v":""},17,"BT","Q",{"$f":"IF(Dashboard!BT$14=0,\"\",Dashboard!BT$14)","v":""},{"$f":"IF(Dashboard!BT$15=0,\"\",Dashboard!BT$15)","v":""},{"$f":"IF(Dashboard!BT$16=0,\"\",Dashboard!BT$16)","v":""},{"$f":"IF(Dashboard!BT$17=0,\"\",Dashboard!BT$17)","v":""},"","","","","",""]
[{"$f":"IF(Dashboard!BX$13=0,\"\",Dashboard!BX$13)","v":""},18,"BX","RR",{"$f":"IF(Dashboard!BX$14=0,\"\",Dashboard!BX$14)","v":""},{"$f":"IF(Dashboard!BX$15=0,\"\",Dashboard!BX$15)","v":""},{"$f":"IF(Dashboard!BX$16=0,\"\",Dashboard!BX$16)","v":""},{"$f":"IF(Dashboard!BX$17=0,\"\",Dashboard!BX$17)","v":""},"","","","","",""]
[{"$f":"IF(Dashboard!CB$13=0,\"\",Dashboard!CB$13)","v":""},19,"CB","S",{"$f":"IF(Dashboard!CB$14=0,\"\",Dashboard!CB$14)","v":""},{"$f":"IF(Dashboard!CB$15=0,\"\",Dashboard!CB$15)","v":""},{"$f":"IF(Dashboard!CB$16=0,\"\",Dashboard!CB$16)","v":""},{"$f":"IF(Dashboard!CB$17=0,\"\",Dashboard!CB$17)","v":""},"","","","","",""]
[{"$f":"IF(Dashboard!CF$13=0,\"\",Dashboard!CF$13)","v":""},20,"CF","T",{"$f":"IF(Dashboard!CF$14=0,\"\",Dashboard!CF$14)","v":""},{"$f":"IF(Dashboard!CF$15=0,\"\",Dashboard!CF$15)","v":""},{"$f":"IF(Dashboard!CF$16=0,\"\",Dashboard!CF$16)","v":""},{"$f":"IF(Dashboard!CF$17=0,\"\",Dashboard!CF$17)","v":""},"","","","","",""]
[]
[]
[]
["RAG rating text for dashboard"]
[]
["Lowest 10% of similar schools","Much lower than recommended"]
["Lowest 20% of similar schools","Lower than recommended"]
["Broadly in line with similar schools","Broadly in line with recommendations"]
["Middle 20% of similar schools","Higher than recommended"]
["Highest 20% of similar schools","Much higher than recommended"]
["Highest 10% of similar schools"]
[null,"Inadequate"]
[null,"Requires Improvement"]
["High risk","Good"]
["Medium risk","Outstanding"]
["Low risk"]
[null,"Well below average"]
[null,"Below average"]
[null,"Average or above average"]
[null,"Well above average"]
[]
[]
["Primary"]
["Secondary with sixth form"]
["Secondary without sixth form"]
["All-through"]
[{"$f":"\"\"","v":""}]